{"text_format":"2","workbook":"xlsx","n_sheets":3,"sheets":["   ","  "," "],"not_rendered":{"charts":0,"images":1,"macros":0,"external_links":0,"defined_names":3,"comments":0,"pivot_tables":0},"unopened":[],"bounds":{"document_bytes":16777216,"sheet_cells":100000,"run_cost":"one","rows_first":2000,"rows_last":500,"rows_between":2000,"halvings":0,"cell_chars":16384,"cell_head_chars":4096},"cells_cut":0,"cells_raw":0,"read":"whole","date_system":"1900"}

{"sheet":"   ","index":0,"n_rows":78,"n_cols":25,"rows_kept":78,"cut":false,"hidden":false,"merged":[[1,19,1,23],[42,17,43,24],[4,17,5,24],[45,21,45,24],[45,1,45,4],[45,5,45,8],[45,9,45,12],[45,13,45,16],[45,17,45,20],[7,1,7,4],[7,5,7,8],[7,9,7,12],[7,13,7,16],[7,17,7,20],[7,21,7,24]]}
[]
[null,null,"Startår ",2018,{"$nulls":15},"Brugerdefinerede mærkedage >>>"]
[null,null,"Startmåned ","november",null,null,null,{"$f":"IF(D4=12,D2+1,D2)","v":2018},null,null,null,{"$f":"IF(H4=12,H3+1,H3)","v":2019},null,null,null,{"$f":"IF(L4=12,L3+1,L3)","v":2019},null,null,null,{"$f":"IF(P4=12,P3+1,P3)","v":2019},null,null,null,{"$f":"IF(T4=12,T3+1,T3)","v":2019}]
[null,null,null,{"$f":"VLOOKUP(D3,' '!F2:G13,2,FALSE)","v":11},null,null,null,{"$f":"IF(D4=12,1,D4+1)","v":12},null,null,null,{"$f":"IF(H4=12,1,H4+1)","v":1},null,null,null,{"$f":"IF(L4=12,1,L4+1)","v":2},null,null,null,{"$f":"IF(P4=12,1,P4+1)","v":3},null,null,null,{"$f":"IF(T4=12,1,T4+1)","v":4}]
[" ",{"$nulls":16},{"$f":"IF(YEAR(C9)=YEAR(W9),YEAR(C9),YEAR(C9)&\" / \"&YEAR(W9))","v":"2018 / 2019"}]
[]
[]
[null,{"$f":"PROPER(TEXT(DATE($D$2,D4,1),\"mmmm\"))","v":"November"},null,null,null,{"$f":"PROPER(TEXT(DATE($D$2,H4,1),\"mmmm\"))","v":"December"},null,null,null,{"$f":"PROPER(TEXT(DATE($D$2,L4,1),\"mmmm\"))","v":"Januar"},null,null,null,{"$f":"PROPER(TEXT(DATE($D$2,P4,1),\"mmmm\"))","v":"Februar"},null,null,null,{"$f":"PROPER(TEXT(DATE($D$2,T4,1),\"mmmm\"))","v":"Marts"},null,null,null,{"$f":"PROPER(TEXT(DATE($D$2,X4,1),\"mmmm\"))","v":"April"}]
[null,{"$f":"WEEKDAY(C9,1)","v":"1900-01-05"},{"$f":"DATE(D$2,D$4,1)","v":"2018-11-01"},{"$f":"IF(ISERROR(VLOOKUP(C9,'  '!$C$5:$D$370,2,FALSE)),IF(ISERROR(VLOOKUP(C9,' '!$A$1:$B$30,2,FALSE)),\"\",VLOOKUP(C9,' '!$A$1:$B$30,2,FALSE)),VLOOKUP(C9,'  '!$C$5:$D$370,2,FALSE))","v":""},{"$f":"IF(B9=2,1+INT((C9-DATE(YEAR(C9+4-WEEKDAY(C9+6)),1,5)+WEEKDAY(DATE(YEAR(C9+4-WEEKDAY(C9+6)),1,3)))/7),\"\")","v":""},{"$f":"WEEKDAY(G9,1)","v":"1900-01-07"},{"$f":"DATE(H$3,H$4,1)","v":"2018-12-01"},{"$f":"IF(ISERROR(VLOOKUP(G9,'  '!$C$5:$D$370,2,FALSE)),IF(ISERROR(VLOOKUP(G9,' '!$A$1:$B$30,2,FALSE)),\"\",VLOOKUP(G9,' '!$A$1:$B$30,2,FALSE)),VLOOKUP(G9,'  '!$C$5:$D$370,2,FALSE))","v":""},{"$f":"IF(F9=2,1+INT((G9-DATE(YEAR(G9+4-WEEKDAY(G9+6)),1,5)+WEEKDAY(DATE(YEAR(G9+4-WEEKDAY(G9+6)),1,3)))/7),\"\")","v":""},{"$f":"WEEKDAY(K9,1)","v":"1900-01-03"},{"$f":"DATE(L$3,L$4,1)","v":"2019-01-01"},{"$f":"IF(ISERROR(VLOOKUP(K9,'  '!$C$5:$D$370,2,FALSE)),IF(ISERROR(VLOOKUP(K9,' '!$A$1:$B$30,2,FALSE)),\"\",VLOOKUP(K9,' '!$A$1:$B$30,2,FALSE)),VLOOKUP(K9,'  '!$C$5:$D$370,2,FALSE))","v":"Nytårsdag"},{"$f":"IF(J9=2,1+INT((K9-DATE(YEAR(K9+4-WEEKDAY(K9+6)),1,5)+WEEKDAY(DATE(YEAR(K9+4-WEEKDAY(K9+6)),1,3)))/7),\"\")","v":""},{"$f":"WEEKDAY(O9,1)","v":"1900-01-06"},{"$f":"DATE(P$3,P$4,1)","v":"2019-02-01"},{"$f":"IF(ISERROR(VLOOKUP(O9,'  '!$C$5:$D$370,2,FALSE)),IF(ISERROR(VLOOKUP(O9,' '!$A$1:$B$30,2,FALSE)),\"\",VLOOKUP(O9,' '!$A$1:$B$30,2,FALSE)),VLOOKUP(O9,'  '!$C$5:$D$370,2,FALSE))","v":""},{"$f":"IF(N9=2,1+INT((O9-DATE(YEAR(O9+4-WEEKDAY(O9+6)),1,5)+WEEKDAY(DATE(YEAR(O9+4-WEEKDAY(O9+6)),1,3)))/7),\"\")","v":""},{"$f":"WEEKDAY(S9,1)","v":"1900-01-06"},{"$f":"DATE(T$3,T$4,1)","v":"2019-03-01"},{"$f":"IF(ISERROR(VLOOKUP(S9,'  '!$C$5:$D$370,2,FALSE)),IF(ISERROR(VLOOKUP(S9,' '!$A$1:$B$30,2,FALSE)),\"\",VLOOKUP(S9,' '!$A$1:$B$30,2,FALSE)),VLOOKUP(S9,'  '!$C$5:$D$370,2,FALSE))","v":""},{"$f":"IF(R9=2,1+INT((S9-DATE(YEAR(S9+4-WEEKDAY(S9+6)),1,5)+WEEKDAY(DATE(YEAR(S9+4-WEEKDAY(S9+6)),1,3)))/7),\"\")","v":""},{"$f":"WEEKDAY(W9,1)","v":"1900-01-02"},{"$f":"DATE(X$3,X$4,1)","v":"2019-04-01"},{"$f":"IF(ISERROR(VLOOKUP(W9,'  '!$C$5:$D$370,2,FALSE)),IF(ISERROR(VLOOKUP(W9,' '!$A$1:$B$30,2,FALSE)),\"\",VLOOKUP(W9,' '!$A$1:$B$30,2,FALSE)),VLOOKUP(W9,'  '!$C$5:$D$370,2,FALSE))","v":""},{"$f":"IF(V9=2,1+INT((W9-DATE(YEAR(W9+4-WEEKDAY(W9+6)),1,5)+WEEKDAY(DATE(YEAR(W9+4-WEEKDAY(W9+6)),1,3)))/7),\"\")","v":14}]
[null,{"$f":"WEEKDAY(C10,1)","v":"1900-01-06"},{"$f":"C9+1","v":"2018-11-02"},{"$f":"IF(ISERROR(VLOOKUP(C10,'  '!$C$5:$D$370,2,FALSE)),IF(ISERROR(VLOOKUP(C10,' '!$A$1:$B$30,2,FALSE)),\"\",VLOOKUP(C10,' '!$A$1:$B$30,2,FALSE)),VLOOKUP(C10,'  '!$C$5:$D$370,2,FALSE))","v":""},{"$f":"IF(B10=2,1+INT((C10-DATE(YEAR(C10+4-WEEKDAY(C10+6)),1,5)+WEEKDAY(DATE(YEAR(C10+4-WEEKDAY(C10+6)),1,3)))/7),\"\")","v":""},{"$f":"WEEKDAY(G10,1)","v":"1900-01-01"},{"$f":"G9+1","v":"2018-12-02"},{"$f":"IF(ISERROR(VLOOKUP(G10,'  '!$C$5:$D$370,2,FALSE)),IF(ISERROR(VLOOKUP(G10,' '!$A$1:$B$30,2,FALSE)),\"\",VLOOKUP(G10,' '!$A$1:$B$30,2,FALSE)),VLOOKUP(G10,'  '!$C$5:$D$370,2,FALSE))","v":""},{"$f":"IF(F10=2,1+INT((G10-DATE(YEAR(G10+4-WEEKDAY(G10+6)),1,5)+WEEKDAY(DATE(YEAR(G10+4-WEEKDAY(G10+6)),1,3)))/7),\"\")","v":""},{"$f":"WEEKDAY(K10,1)","v":"1900-01-04"},{"$f":"K9+1","v":"2019-01-02"},{"$f":"IF(ISERROR(VLOOKUP(K10,'  '!$C$5:$D$370,2,FALSE)),IF(ISERROR(VLOOKUP(K10,' '!$A$1:$B$30,2,FALSE)),\"\",VLOOKUP(K10,' '!$A$1:$B$30,2,FALSE)),VLOOKUP(K10,'  '!$C$5:$D$370,2,FALSE))","v":""},{"$f":"IF(J10=2,1+INT((K10-DATE(YEAR(K10+4-WEEKDAY(K10+6)),1,5)+WEEKDAY(DATE(YEAR(K10+4-WEEKDAY(K10+6)),1,3)))/7),\"\")","v":""},{"$f":"WEEKDAY(O10,1)","v":"1900-01-07"},{"$f":"O9+1","v":"2019-02-02"},{"$f":"IF(ISERROR(VLOOKUP(O10,'  '!$C$5:$D$370,2,FALSE)),IF(ISERROR(VLOOKUP(O10,' '!$A$1:$B$30,2,FALSE)),\"\",VLOOKUP(O10,' '!$A$1:$B$30,2,FALSE)),VLOOKUP(O10,'  '!$C$5:$D$370,2,FALSE))","v":""},{"$f":"IF(N10=2,1+INT((O10-DATE(YEAR(O10+4-WEEKDAY(O10+6)),1,5)+WEEKDAY(DATE(YEAR(O10+4-WEEKDAY(O10+6)),1,3)))/7),\"\")","v":""},{"$f":"WEEKDAY(S10,1)","v":"1900-01-07"},{"$f":"S9+1","v":"2019-03-02"},{"$f":"IF(ISERROR(VLOOKUP(S10,'  '!$C$5:$D$370,2,FALSE)),IF(ISERROR(VLOOKUP(S10,' '!$A$1:$B$30,2,FALSE)),\"\",VLOOKUP(S10,' '!$A$1:$B$30,2,FALSE)),VLOOKUP(S10,'  '!$C$5:$D$370,2,FALSE))","v":""},{"$f":"IF(R10=2,1+INT((S10-DATE(YEAR(S10+4-WEEKDAY(S10+6)),1,5)+WEEKDAY(DATE(YEAR(S10+4-WEEKDAY(S10+6)),1,3)))/7),\"\")","v":""},{"$f":"WEEKDAY(W10,1)","v":"1900-01-03"},{"$f":"W9+1","v":"2019-04-02"},{"$f":"IF(ISERROR(VLOOKUP(W10,'  '!$C$5:$D$370,2,FALSE)),IF(ISERROR(VLOOKUP(W10,' '!$A$1:$B$30,2,FALSE)),\"\",VLOOKUP(W10,' '!$A$1:$B$30,2,FALSE)),VLOOKUP(W10,'  '!$C$5:$D$370,2,FALSE))","v":""},{"$f":"IF(V10=2,1+INT((W10-DATE(YEAR(W10+4-WEEKDAY(W10+6)),1,5)+WEEKDAY(DATE(YEAR(W10+4-WEEKDAY(W10+6)),1,3)))/7),\"\")","v":""}]
[null,"1900-01-07",{"$f":"C10+1","v":"2018-11-03"},"Gl. drenge","","1900-01-02",{"$f":"G10+1","v":"2018-12-03"},{"$f":"IF(ISERROR(VLOOKUP(G11,'  '!$C$5:$D$370,2,FALSE)),IF(ISERROR(VLOOKUP(G11,' '!$A$1:$B$30,2,FALSE)),\"\",VLOOKUP(G11,' '!$A$1:$B$30,2,FALSE)),VLOOKUP(G11,'  '!$C$5:$D$370,2,FALSE))","v":""},49,"1900-01-05",{"$f":"K10+1","v":"2019-01-03"},null,"","1900-01-01",{"$f":"O10+1","v":"2019-02-03"},{"$f":"IF(ISERROR(VLOOKUP(O11,'  '!$C$5:$D$370,2,FALSE)),IF(ISERROR(VLOOKUP(O11,' '!$A$1:$B$30,2,FALSE)),\"\",VLOOKUP(O11,' '!$A$1:$B$30,2,FALSE)),VLOOKUP(O11,'  '!$C$5:$D$370,2,FALSE))","v":""},"","1900-01-01",{"$f":"S10+1","v":"2019-03-03"},{"$f":"IF(ISERROR(VLOOKUP(S11,'  '!$C$5:$D$370,2,FALSE)),IF(ISERROR(VLOOKUP(S11,' '!$A$1:$B$30,2,FALSE)),\"\",VLOOKUP(S11,' '!$A$1:$B$30,2,FALSE)),VLOOKUP(S11,'  '!$C$5:$D$370,2,FALSE))","v":""},"","1900-01-04",{"$f":"W10+1","v":"2019-04-03"},{"$f":"IF(ISERROR(VLOOKUP(W11,'  '!$C$5:$D$370,2,FALSE)),IF(ISERROR(VLOOKUP(W11,' '!$A$1:$B$30,2,FALSE)),\"\",VLOOKUP(W11,' '!$A$1:$B$30,2,FALSE)),VLOOKUP(W11,'  '!$C$5:$D$370,2,FALSE))","v":""},""]
[null,"1900-01-01","2018-11-04",{"$f":"IF(ISERROR(VLOOKUP(C12,'  '!$C$5:$D$370,2,FALSE)),IF(ISERROR(VLOOKUP(C12,' '!$A$1:$B$30,2,FALSE)),\"\",VLOOKUP(C12,' '!$A$1:$B$30,2,FALSE)),VLOOKUP(C12,'  '!$C$5:$D$370,2,FALSE))","v":""},"","1900-01-03","2018-12-04",{"$f":"IF(ISERROR(VLOOKUP(G12,'  '!$C$5:$D$370,2,FALSE)),IF(ISERROR(VLOOKUP(G12,' '!$A$1:$B$30,2,FALSE)),\"\",VLOOKUP(G12,' '!$A$1:$B$30,2,FALSE)),VLOOKUP(G12,'  '!$C$5:$D$370,2,FALSE))","v":""},"","1900-01-06","2019-01-04",{"$f":"IF(ISERROR(VLOOKUP(K12,'  '!$C$5:$D$370,2,FALSE)),IF(ISERROR(VLOOKUP(K12,' '!$A$1:$B$30,2,FALSE)),\"\",VLOOKUP(K12,' '!$A$1:$B$30,2,FALSE)),VLOOKUP(K12,'  '!$C$5:$D$370,2,FALSE))","v":""},"","1900-01-02","2019-02-04",{"$f":"IF(ISERROR(VLOOKUP(O12,'  '!$C$5:$D$370,2,FALSE)),IF(ISERROR(VLOOKUP(O12,' '!$A$1:$B$30,2,FALSE)),\"\",VLOOKUP(O12,' '!$A$1:$B$30,2,FALSE)),VLOOKUP(O12,'  '!$C$5:$D$370,2,FALSE))","v":""},6,"1900-01-02","2019-03-04",{"$f":"IF(ISERROR(VLOOKUP(S12,'  '!$C$5:$D$370,2,FALSE)),IF(ISERROR(VLOOKUP(S12,' '!$A$1:$B$30,2,FALSE)),\"\",VLOOKUP(S12,' '!$A$1:$B$30,2,FALSE)),VLOOKUP(S12,'  '!$C$5:$D$370,2,FALSE))","v":""},10,"1900-01-05","2019-04-04",{"$f":"IF(ISERROR(VLOOKUP(W12,'  '!$C$5:$D$370,2,FALSE)),IF(ISERROR(VLOOKUP(W12,' '!$A$1:$B$30,2,FALSE)),\"\",VLOOKUP(W12,' '!$A$1:$B$30,2,FALSE)),VLOOKUP(W12,'  '!$C$5:$D$370,2,FALSE))","v":""},""]
[null,"1900-01-02","2018-11-05",{"$f":"IF(ISERROR(VLOOKUP(C13,'  '!$C$5:$D$370,2,FALSE)),IF(ISERROR(VLOOKUP(C13,' '!$A$1:$B$30,2,FALSE)),\"\",VLOOKUP(C13,' '!$A$1:$B$30,2,FALSE)),VLOOKUP(C13,'  '!$C$5:$D$370,2,FALSE))","v":""},45,"1900-01-04","2018-12-05",{"$f":"IF(ISERROR(VLOOKUP(G13,'  '!$C$5:$D$370,2,FALSE)),IF(ISERROR(VLOOKUP(G13,' '!$A$1:$B$30,2,FALSE)),\"\",VLOOKUP(G13,' '!$A$1:$B$30,2,FALSE)),VLOOKUP(G13,'  '!$C$5:$D$370,2,FALSE))","v":""},"","1900-01-07","2019-01-05",{"$f":"IF(ISERROR(VLOOKUP(K13,'  '!$C$5:$D$370,2,FALSE)),IF(ISERROR(VLOOKUP(K13,' '!$A$1:$B$30,2,FALSE)),\"\",VLOOKUP(K13,' '!$A$1:$B$30,2,FALSE)),VLOOKUP(K13,'  '!$C$5:$D$370,2,FALSE))","v":""},"","1900-01-03","2019-02-05",{"$f":"IF(ISERROR(VLOOKUP(O13,'  '!$C$5:$D$370,2,FALSE)),IF(ISERROR(VLOOKUP(O13,' '!$A$1:$B$30,2,FALSE)),\"\",VLOOKUP(O13,' '!$A$1:$B$30,2,FALSE)),VLOOKUP(O13,'  '!$C$5:$D$370,2,FALSE))","v":""},"","1900-01-03","2019-03-05",{"$f":"IF(ISERROR(VLOOKUP(S13,'  '!$C$5:$D$370,2,FALSE)),IF(ISERROR(VLOOKUP(S13,' '!$A$1:$B$30,2,FALSE)),\"\",VLOOKUP(S13,' '!$A$1:$B$30,2,FALSE)),VLOOKUP(S13,'  '!$C$5:$D$370,2,FALSE))","v":""},"","1900-01-06","2019-04-05",{"$f":"IF(ISERROR(VLOOKUP(W13,'  '!$C$5:$D$370,2,FALSE)),IF(ISERROR(VLOOKUP(W13,' '!$A$1:$B$30,2,FALSE)),\"\",VLOOKUP(W13,' '!$A$1:$B$30,2,FALSE)),VLOOKUP(W13,'  '!$C$5:$D$370,2,FALSE))","v":""},""]
[null,"1900-01-03","2018-11-06",{"$f":"IF(ISERROR(VLOOKUP(C14,'  '!$C$5:$D$370,2,FALSE)),IF(ISERROR(VLOOKUP(C14,' '!$A$1:$B$30,2,FALSE)),\"\",VLOOKUP(C14,' '!$A$1:$B$30,2,FALSE)),VLOOKUP(C14,'  '!$C$5:$D$370,2,FALSE))","v":""},"","1900-01-05","2018-12-06",{"$f":"IF(ISERROR(VLOOKUP(G14,'  '!$C$5:$D$370,2,FALSE)),IF(ISERROR(VLOOKUP(G14,' '!$A$1:$B$30,2,FALSE)),\"\",VLOOKUP(G14,' '!$A$1:$B$30,2,FALSE)),VLOOKUP(G14,'  '!$C$5:$D$370,2,FALSE))","v":""},"","1900-01-01","2019-01-06",{"$f":"IF(ISERROR(VLOOKUP(K14,'  '!$C$5:$D$370,2,FALSE)),IF(ISERROR(VLOOKUP(K14,' '!$A$1:$B$30,2,FALSE)),\"\",VLOOKUP(K14,' '!$A$1:$B$30,2,FALSE)),VLOOKUP(K14,'  '!$C$5:$D$370,2,FALSE))","v":""},"","1900-01-04","2019-02-06",{"$f":"IF(ISERROR(VLOOKUP(O14,'  '!$C$5:$D$370,2,FALSE)),IF(ISERROR(VLOOKUP(O14,' '!$A$1:$B$30,2,FALSE)),\"\",VLOOKUP(O14,' '!$A$1:$B$30,2,FALSE)),VLOOKUP(O14,'  '!$C$5:$D$370,2,FALSE))","v":""},"","1900-01-04","2019-03-06",{"$f":"IF(ISERROR(VLOOKUP(S14,'  '!$C$5:$D$370,2,FALSE)),IF(ISERROR(VLOOKUP(S14,' '!$A$1:$B$30,2,FALSE)),\"\",VLOOKUP(S14,' '!$A$1:$B$30,2,FALSE)),VLOOKUP(S14,'  '!$C$5:$D$370,2,FALSE))","v":""},"","1900-01-07","2019-04-06",{"$f":"IF(ISERROR(VLOOKUP(W14,'  '!$C$5:$D$370,2,FALSE)),IF(ISERROR(VLOOKUP(W14,' '!$A$1:$B$30,2,FALSE)),\"\",VLOOKUP(W14,' '!$A$1:$B$30,2,FALSE)),VLOOKUP(W14,'  '!$C$5:$D$370,2,FALSE))","v":""},""]
[null,"1900-01-04","2018-11-07",{"$f":"IF(ISERROR(VLOOKUP(C15,'  '!$C$5:$D$370,2,FALSE)),IF(ISERROR(VLOOKUP(C15,' '!$A$1:$B$30,2,FALSE)),\"\",VLOOKUP(C15,' '!$A$1:$B$30,2,FALSE)),VLOOKUP(C15,'  '!$C$5:$D$370,2,FALSE))","v":""},"","1900-01-06","2018-12-07",{"$f":"IF(ISERROR(VLOOKUP(G15,'  '!$C$5:$D$370,2,FALSE)),IF(ISERROR(VLOOKUP(G15,' '!$A$1:$B$30,2,FALSE)),\"\",VLOOKUP(G15,' '!$A$1:$B$30,2,FALSE)),VLOOKUP(G15,'  '!$C$5:$D$370,2,FALSE))","v":""},"","1900-01-02","2019-01-07",{"$f":"IF(ISERROR(VLOOKUP(K15,'  '!$C$5:$D$370,2,FALSE)),IF(ISERROR(VLOOKUP(K15,' '!$A$1:$B$30,2,FALSE)),\"\",VLOOKUP(K15,' '!$A$1:$B$30,2,FALSE)),VLOOKUP(K15,'  '!$C$5:$D$370,2,FALSE))","v":""},2,"1900-01-05","2019-02-07",{"$f":"IF(ISERROR(VLOOKUP(O15,'  '!$C$5:$D$370,2,FALSE)),IF(ISERROR(VLOOKUP(O15,' '!$A$1:$B$30,2,FALSE)),\"\",VLOOKUP(O15,' '!$A$1:$B$30,2,FALSE)),VLOOKUP(O15,'  '!$C$5:$D$370,2,FALSE))","v":""},"","1900-01-05","2019-03-07",{"$f":"IF(ISERROR(VLOOKUP(S15,'  '!$C$5:$D$370,2,FALSE)),IF(ISERROR(VLOOKUP(S15,' '!$A$1:$B$30,2,FALSE)),\"\",VLOOKUP(S15,' '!$A$1:$B$30,2,FALSE)),VLOOKUP(S15,'  '!$C$5:$D$370,2,FALSE))","v":""},"","1900-01-01","2019-04-07",{"$f":"IF(ISERROR(VLOOKUP(W15,'  '!$C$5:$D$370,2,FALSE)),IF(ISERROR(VLOOKUP(W15,' '!$A$1:$B$30,2,FALSE)),\"\",VLOOKUP(W15,' '!$A$1:$B$30,2,FALSE)),VLOOKUP(W15,'  '!$C$5:$D$370,2,FALSE))","v":""},""]
[null,"1900-01-05","2018-11-08",{"$f":"IF(ISERROR(VLOOKUP(C16,'  '!$C$5:$D$370,2,FALSE)),IF(ISERROR(VLOOKUP(C16,' '!$A$1:$B$30,2,FALSE)),\"\",VLOOKUP(C16,' '!$A$1:$B$30,2,FALSE)),VLOOKUP(C16,'  '!$C$5:$D$370,2,FALSE))","v":""},"","1900-01-07","2018-12-08",{"$f":"IF(ISERROR(VLOOKUP(G16,'  '!$C$5:$D$370,2,FALSE)),IF(ISERROR(VLOOKUP(G16,' '!$A$1:$B$30,2,FALSE)),\"\",VLOOKUP(G16,' '!$A$1:$B$30,2,FALSE)),VLOOKUP(G16,'  '!$C$5:$D$370,2,FALSE))","v":""},"","1900-01-03","2019-01-08",{"$f":"IF(ISERROR(VLOOKUP(K16,'  '!$C$5:$D$370,2,FALSE)),IF(ISERROR(VLOOKUP(K16,' '!$A$1:$B$30,2,FALSE)),\"\",VLOOKUP(K16,' '!$A$1:$B$30,2,FALSE)),VLOOKUP(K16,'  '!$C$5:$D$370,2,FALSE))","v":""},"","1900-01-06","2019-02-08",{"$f":"IF(ISERROR(VLOOKUP(O16,'  '!$C$5:$D$370,2,FALSE)),IF(ISERROR(VLOOKUP(O16,' '!$A$1:$B$30,2,FALSE)),\"\",VLOOKUP(O16,' '!$A$1:$B$30,2,FALSE)),VLOOKUP(O16,'  '!$C$5:$D$370,2,FALSE))","v":""},"","1900-01-06","2019-03-08",{"$f":"IF(ISERROR(VLOOKUP(S16,'  '!$C$5:$D$370,2,FALSE)),IF(ISERROR(VLOOKUP(S16,' '!$A$1:$B$30,2,FALSE)),\"\",VLOOKUP(S16,' '!$A$1:$B$30,2,FALSE)),VLOOKUP(S16,'  '!$C$5:$D$370,2,FALSE))","v":""},"","1900-01-02","2019-04-08",{"$f":"IF(ISERROR(VLOOKUP(W16,'  '!$C$5:$D$370,2,FALSE)),IF(ISERROR(VLOOKUP(W16,' '!$A$1:$B$30,2,FALSE)),\"\",VLOOKUP(W16,' '!$A$1:$B$30,2,FALSE)),VLOOKUP(W16,'  '!$C$5:$D$370,2,FALSE))","v":""},15]
[null,"1900-01-06","2018-11-09",{"$f":"IF(ISERROR(VLOOKUP(C17,'  '!$C$5:$D$370,2,FALSE)),IF(ISERROR(VLOOKUP(C17,' '!$A$1:$B$30,2,FALSE)),\"\",VLOOKUP(C17,' '!$A$1:$B$30,2,FALSE)),VLOOKUP(C17,'  '!$C$5:$D$370,2,FALSE))","v":""},"","1900-01-01","2018-12-09",{"$f":"IF(ISERROR(VLOOKUP(G17,'  '!$C$5:$D$370,2,FALSE)),IF(ISERROR(VLOOKUP(G17,' '!$A$1:$B$30,2,FALSE)),\"\",VLOOKUP(G17,' '!$A$1:$B$30,2,FALSE)),VLOOKUP(G17,'  '!$C$5:$D$370,2,FALSE))","v":""},"","1900-01-04","2019-01-09",{"$f":"IF(ISERROR(VLOOKUP(K17,'  '!$C$5:$D$370,2,FALSE)),IF(ISERROR(VLOOKUP(K17,' '!$A$1:$B$30,2,FALSE)),\"\",VLOOKUP(K17,' '!$A$1:$B$30,2,FALSE)),VLOOKUP(K17,'  '!$C$5:$D$370,2,FALSE))","v":""},"","1900-01-07","2019-02-09",{"$f":"IF(ISERROR(VLOOKUP(O17,'  '!$C$5:$D$370,2,FALSE)),IF(ISERROR(VLOOKUP(O17,' '!$A$1:$B$30,2,FALSE)),\"\",VLOOKUP(O17,' '!$A$1:$B$30,2,FALSE)),VLOOKUP(O17,'  '!$C$5:$D$370,2,FALSE))","v":""},"","1900-01-07","2019-03-09",{"$f":"IF(ISERROR(VLOOKUP(S17,'  '!$C$5:$D$370,2,FALSE)),IF(ISERROR(VLOOKUP(S17,' '!$A$1:$B$30,2,FALSE)),\"\",VLOOKUP(S17,' '!$A$1:$B$30,2,FALSE)),VLOOKUP(S17,'  '!$C$5:$D$370,2,FALSE))","v":""},"","1900-01-03","2019-04-09",{"$f":"IF(ISERROR(VLOOKUP(W17,'  '!$C$5:$D$370,2,FALSE)),IF(ISERROR(VLOOKUP(W17,' '!$A$1:$B$30,2,FALSE)),\"\",VLOOKUP(W17,' '!$A$1:$B$30,2,FALSE)),VLOOKUP(W17,'  '!$C$5:$D$370,2,FALSE))","v":""},""]
[null,"1900-01-07","2018-11-10",{"$f":"IF(ISERROR(VLOOKUP(C18,'  '!$C$5:$D$370,2,FALSE)),IF(ISERROR(VLOOKUP(C18,' '!$A$1:$B$30,2,FALSE)),\"\",VLOOKUP(C18,' '!$A$1:$B$30,2,FALSE)),VLOOKUP(C18,'  '!$C$5:$D$370,2,FALSE))","v":""},"","1900-01-02","2018-12-10",{"$f":"IF(ISERROR(VLOOKUP(G18,'  '!$C$5:$D$370,2,FALSE)),IF(ISERROR(VLOOKUP(G18,' '!$A$1:$B$30,2,FALSE)),\"\",VLOOKUP(G18,' '!$A$1:$B$30,2,FALSE)),VLOOKUP(G18,'  '!$C$5:$D$370,2,FALSE))","v":""},50,"1900-01-05","2019-01-10",{"$f":"IF(ISERROR(VLOOKUP(K18,'  '!$C$5:$D$370,2,FALSE)),IF(ISERROR(VLOOKUP(K18,' '!$A$1:$B$30,2,FALSE)),\"\",VLOOKUP(K18,' '!$A$1:$B$30,2,FALSE)),VLOOKUP(K18,'  '!$C$5:$D$370,2,FALSE))","v":""},"","1900-01-01","2019-02-10",{"$f":"IF(ISERROR(VLOOKUP(O18,'  '!$C$5:$D$370,2,FALSE)),IF(ISERROR(VLOOKUP(O18,' '!$A$1:$B$30,2,FALSE)),\"\",VLOOKUP(O18,' '!$A$1:$B$30,2,FALSE)),VLOOKUP(O18,'  '!$C$5:$D$370,2,FALSE))","v":""},"","1900-01-01","2019-03-10",{"$f":"IF(ISERROR(VLOOKUP(S18,'  '!$C$5:$D$370,2,FALSE)),IF(ISERROR(VLOOKUP(S18,' '!$A$1:$B$30,2,FALSE)),\"\",VLOOKUP(S18,' '!$A$1:$B$30,2,FALSE)),VLOOKUP(S18,'  '!$C$5:$D$370,2,FALSE))","v":""},"","1900-01-04","2019-04-10",{"$f":"IF(ISERROR(VLOOKUP(W18,'  '!$C$5:$D$370,2,FALSE)),IF(ISERROR(VLOOKUP(W18,' '!$A$1:$B$30,2,FALSE)),\"\",VLOOKUP(W18,' '!$A$1:$B$30,2,FALSE)),VLOOKUP(W18,'  '!$C$5:$D$370,2,FALSE))","v":""},""]
[null,"1900-01-01","2018-11-11",{"$f":"IF(ISERROR(VLOOKUP(C19,'  '!$C$5:$D$370,2,FALSE)),IF(ISERROR(VLOOKUP(C19,' '!$A$1:$B$30,2,FALSE)),\"\",VLOOKUP(C19,' '!$A$1:$B$30,2,FALSE)),VLOOKUP(C19,'  '!$C$5:$D$370,2,FALSE))","v":""},"","1900-01-03","2018-12-11",{"$f":"IF(ISERROR(VLOOKUP(G19,'  '!$C$5:$D$370,2,FALSE)),IF(ISERROR(VLOOKUP(G19,' '!$A$1:$B$30,2,FALSE)),\"\",VLOOKUP(G19,' '!$A$1:$B$30,2,FALSE)),VLOOKUP(G19,'  '!$C$5:$D$370,2,FALSE))","v":""},"","1900-01-06","2019-01-11",{"$f":"IF(ISERROR(VLOOKUP(K19,'  '!$C$5:$D$370,2,FALSE)),IF(ISERROR(VLOOKUP(K19,' '!$A$1:$B$30,2,FALSE)),\"\",VLOOKUP(K19,' '!$A$1:$B$30,2,FALSE)),VLOOKUP(K19,'  '!$C$5:$D$370,2,FALSE))","v":""},"","1900-01-02","2019-02-11",{"$f":"IF(ISERROR(VLOOKUP(O19,'  '!$C$5:$D$370,2,FALSE)),IF(ISERROR(VLOOKUP(O19,' '!$A$1:$B$30,2,FALSE)),\"\",VLOOKUP(O19,' '!$A$1:$B$30,2,FALSE)),VLOOKUP(O19,'  '!$C$5:$D$370,2,FALSE))","v":""},7,"1900-01-02","2019-03-11",{"$f":"IF(ISERROR(VLOOKUP(S19,'  '!$C$5:$D$370,2,FALSE)),IF(ISERROR(VLOOKUP(S19,' '!$A$1:$B$30,2,FALSE)),\"\",VLOOKUP(S19,' '!$A$1:$B$30,2,FALSE)),VLOOKUP(S19,'  '!$C$5:$D$370,2,FALSE))","v":""},11,"1900-01-05","2019-04-11",{"$f":"IF(ISERROR(VLOOKUP(W19,'  '!$C$5:$D$370,2,FALSE)),IF(ISERROR(VLOOKUP(W19,' '!$A$1:$B$30,2,FALSE)),\"\",VLOOKUP(W19,' '!$A$1:$B$30,2,FALSE)),VLOOKUP(W19,'  '!$C$5:$D$370,2,FALSE))","v":""},""]
[null,"1900-01-02","2018-11-12",{"$f":"IF(ISERROR(VLOOKUP(C20,'  '!$C$5:$D$370,2,FALSE)),IF(ISERROR(VLOOKUP(C20,' '!$A$1:$B$30,2,FALSE)),\"\",VLOOKUP(C20,' '!$A$1:$B$30,2,FALSE)),VLOOKUP(C20,'  '!$C$5:$D$370,2,FALSE))","v":""},46,"1900-01-04","2018-12-12",{"$f":"IF(ISERROR(VLOOKUP(G20,'  '!$C$5:$D$370,2,FALSE)),IF(ISERROR(VLOOKUP(G20,' '!$A$1:$B$30,2,FALSE)),\"\",VLOOKUP(G20,' '!$A$1:$B$30,2,FALSE)),VLOOKUP(G20,'  '!$C$5:$D$370,2,FALSE))","v":""},"","1900-01-07","2019-01-12",{"$f":"IF(ISERROR(VLOOKUP(K20,'  '!$C$5:$D$370,2,FALSE)),IF(ISERROR(VLOOKUP(K20,' '!$A$1:$B$30,2,FALSE)),\"\",VLOOKUP(K20,' '!$A$1:$B$30,2,FALSE)),VLOOKUP(K20,'  '!$C$5:$D$370,2,FALSE))","v":""},"","1900-01-03","2019-02-12",{"$f":"IF(ISERROR(VLOOKUP(O20,'  '!$C$5:$D$370,2,FALSE)),IF(ISERROR(VLOOKUP(O20,' '!$A$1:$B$30,2,FALSE)),\"\",VLOOKUP(O20,' '!$A$1:$B$30,2,FALSE)),VLOOKUP(O20,'  '!$C$5:$D$370,2,FALSE))","v":""},"","1900-01-03","2019-03-12",{"$f":"IF(ISERROR(VLOOKUP(S20,'  '!$C$5:$D$370,2,FALSE)),IF(ISERROR(VLOOKUP(S20,' '!$A$1:$B$30,2,FALSE)),\"\",VLOOKUP(S20,' '!$A$1:$B$30,2,FALSE)),VLOOKUP(S20,'  '!$C$5:$D$370,2,FALSE))","v":""},"","1900-01-06","2019-04-12",{"$f":"IF(ISERROR(VLOOKUP(W20,'  '!$C$5:$D$370,2,FALSE)),IF(ISERROR(VLOOKUP(W20,' '!$A$1:$B$30,2,FALSE)),\"\",VLOOKUP(W20,' '!$A$1:$B$30,2,FALSE)),VLOOKUP(W20,'  '!$C$5:$D$370,2,FALSE))","v":""},""]
{"$rows_left_out":59}
{"sheet":"  ","index":1,"n_rows":4,"n_cols":4,"rows_kept":4,"cut":false,"hidden":false,"merged":[[2,2,2,3],[0,0,0,1]]}
["<<< Tilbage til kalender"]
[]
[null,null,"Brugerdefinerede mærkedage"]
[null,null,"Dato↓ (format dd-mm-åååå)","Tekst↓"]

{"sheet":" ","index":2,"n_rows":45,"n_cols":7,"rows_kept":45,"cut":false,"hidden":true,"merged":[]}
["Dato","Navn",null,null,null,"Måneder","Tal"]
[{"$f":"DATE(B35,1,1)","v":"2018-01-01"},"Nytårsdag",null,null,null,"Januar",1]
[{"$f":"A6-7","v":"2018-03-25"},"Palmesøndag",null,null,null,"Februar",2]
[{"$f":"A6-3","v":"2018-03-29"},"Skærtorsdag",null,null,null,"Marts",3]
[{"$f":"A6-2","v":"2018-03-30"},"Langfredag",null,null,null,"April",4]
[{"$f":"IF(22+B39+B40<=31,DATE(B35,3,0)+IF(22+B39+B40>31,IF(AND(B39=29,B40=6),19,IF(AND(B39=28,B40=6,B36>10),18,B39+B40-9)),22+B39+B40),DATE(B35,4,0)+IF(22+B39+B40>31,IF(AND(B39=29,B40=6),19,IF(AND(B39=28,B40=6,B36>10),18,B39+B40-9)),22+B39+B40))","v":"2018-04-01"},"Påskedag",null,null,null,"Maj",5]
[{"$f":"A6+1","v":"2018-04-02"},"2. påskedag",null,null,null,"Juni",6]
[{"$f":"A6+26","v":"2018-04-27"},"Store Bededag",null,null,null,"Juli",7]
[{"$f":"A8+13","v":"2018-05-10"},"Kristi Himmelfart",null,null,null,"August",8]
[{"$f":"A9+10","v":"2018-05-20"},{"$f":"IF(A10=A12,\"Pinsedag/Gr.lovsdag\",\"Pinsedag\")","v":"Pinsedag"},null,null,null,"September",9]
[{"$f":"A10+1","v":"2018-05-21"},{"$f":"IF(A11=A12,\"2. pinsedag/Gr.lovsdag\",\"2. pinsedag\")","v":"2. pinsedag"},null,null,null,"Oktober",10]
[{"$f":"DATE(B35,6,5)","v":"2018-06-05"},"Grundlovsdag",null,null,null,"November",11]
[{"$f":"DATE(B35,12,25)","v":"2018-12-25"},"1. juledag",null,null,null,"December",12]
[{"$f":"A13+1","v":"2018-12-26"},"2. juledag"]
[{"$f":"DATE(B35,12,31)","v":"2018-12-31"},"Nytårsaftens dag"]
[]
[{"$f":"DATE(C35,1,1)","v":"2019-01-01"},"Nytårsdag"]
[{"$f":"A21-7","v":"2019-04-14"},"Palmesøndag"]
[{"$f":"A21-3","v":"2019-04-18"},"Skærtorsdag"]
[{"$f":"A21-2","v":"2019-04-19"},"Langfredag"]
{"$rows_left_out":25}