{"text_format":"2","workbook":"xlsx","n_sheets":3,"sheets":["   ","  "," "],"not_rendered":{"charts":0,"images":1,"macros":0,"external_links":0,"defined_names":3,"comments":0,"pivot_tables":0},"unopened":[],"bounds":{"document_bytes":16777216,"sheet_cells":100000,"run_cost":"one","rows_first":2000,"rows_last":500,"rows_between":2000,"halvings":0,"cell_chars":16384,"cell_head_chars":4096},"cells_cut":0,"cells_raw":0,"read":"whole","date_system":"1900"}

{"sheet":"   ","index":0,"n_rows":78,"n_cols":25,"rows_kept":78,"cut":false,"hidden":false,"merged":[[1,19,1,23],[42,17,43,24],[4,17,5,24],[45,21,45,24],[45,1,45,4],[45,5,45,8],[45,9,45,12],[45,13,45,16],[45,17,45,20],[7,1,7,4],[7,5,7,8],[7,9,7,12],[7,13,7,16],[7,17,7,20],[7,21,7,24]]}
[]
[null,null,"Startår ",2018,{"$nulls":15},"Brugerdefinerede mærkedage >>>"]
[null,null,"Startmåned ","november",null,null,null,{"$f":"IF(D4=12,D2+1,D2)","v":2018},null,null,null,{"$f":"IF(H4=12,H3+1,H3)","v":2019},null,null,null,{"$f":"IF(L4=12,L3+1,L3)","v":2019},null,null,null,{"$f":"IF(P4=12,P3+1,P3)","v":2019},null,null,null,{"$f":"IF(T4=12,T3+1,T3)","v":2019}]
[null,null,null,{"$f":"VLOOKUP(D3,' '!F2:G13,2,FALSE)","v":11},null,null,null,{"$f":"IF(D4=12,1,D4+1)","v":12},null,null,null,{"$f":"IF(H4=12,1,H4+1)","v":1},null,null,null,{"$f":"IF(L4=12,1,L4+1)","v":2},null,null,null,{"$f":"IF(P4=12,1,P4+1)","v":3},null,null,null,{"$f":"IF(T4=12,1,T4+1)","v":4}]
[" ",{"$nulls":16},{"$f":"IF(YEAR(C9)=YEAR(W9),YEAR(C9),YEAR(C9)&\" / \"&YEAR(W9))","v":"2018 / 2019"}]
[]
[]
[null,{"$f":"PROPER(TEXT(DATE($D$2,D4,1),\"mmmm\"))","v":"November"},null,null,null,{"$f":"PROPER(TEXT(DATE($D$2,H4,1),\"mmmm\"))","v":"December"},null,null,null,{"$f":"PROPER(TEXT(DATE($D$2,L4,1),\"mmmm\"))","v":"Januar"},null,null,null,{"$f":"PROPER(TEXT(DATE($D$2,P4,1),\"mmmm\"))","v":"Februar"},null,null,null,{"$f":"PROPER(TEXT(DATE($D$2,T4,1),\"mmmm\"))","v":"Marts"},null,null,null,{"$f":"PROPER(TEXT(DATE($D$2,X4,1),\"mmmm\"))","v":"April"}]
[null,{"$f":"WEEKDAY(C9,1)","v":"1900-01-05"},{"$f":"DATE(D$2,D$4,1)","v":"2018-11-01"},{"$f":"IF(ISERROR(VLOOKUP(C9,'  '!$C$5:$D$370,2,FALSE)),IF(ISERROR(VLOOKUP(C9,' '!$A$1:$B$30,2,FALSE)),\"\",VLOOKUP(C9,' '!$A$1:$B$30,2,FALSE)),VLOOKUP(C9,'  '!$C$5:$D$370,2,FALSE))","v":""},{"$f":"IF(B9=2,1+INT((C9-DATE(YEAR(C9+4-WEEKDAY(C9+6)),1,5)+WEEKDAY(DATE(YEAR(C9+4-WEEKDAY(C9+6)),1,3)))/7),\"\")","v":""},{"$f":"WEEKDAY(G9,1)","v":"1900-01-07"},{"$f":"DATE(H$3,H$4,1)","v":"2018-12-01"},{"$f":"IF(ISERROR(VLOOKUP(G9,'  '!$C$5:$D$370,2,FALSE)),IF(ISERROR(VLOOKUP(G9,' '!$A$1:$B$30,2,FALSE)),\"\",VLOOKUP(G9,' '!$A$1:$B$30,2,FALSE)),VLOOKUP(G9,'  '!$C$5:$D$370,2,FALSE))","v":""},{"$f":"IF(F9=2,1+INT((G9-DATE(YEAR(G9+4-WEEKDAY(G9+6)),1,5)+WEEKDAY(DATE(YEAR(G9+4-WEEKDAY(G9+6)),1,3)))/7),\"\")","v":""},{"$f":"WEEKDAY(K9,1)","v":"1900-01-03"},{"$f":"DATE(L$3,L$4,1)","v":"2019-01-01"},{"$f":"IF(ISERROR(VLOOKUP(K9,'  '!$C$5:$D$370,2,FALSE)),IF(ISERROR(VLOOKUP(K9,' '!$A$1:$B$30,2,FALSE)),\"\",VLOOKUP(K9,' '!$A$1:$B$30,2,FALSE)),VLOOKUP(K9,'  '!$C$5:$D$370,2,FALSE))","v":"Nytårsdag"},{"$f":"IF(J9=2,1+INT((K9-DATE(YEAR(K9+4-WEEKDAY(K9+6)),1,5)+WEEKDAY(DATE(YEAR(K9+4-WEEKDAY(K9+6)),1,3)))/7),\"\")","v":""},{"$f":"WEEKDAY(O9,1)","v":"1900-01-06"},{"$f":"DATE(P$3,P$4,1)","v":"2019-02-01"},{"$f":"IF(ISERROR(VLOOKUP(O9,'  '!$C$5:$D$370,2,FALSE)),IF(ISERROR(VLOOKUP(O9,' '!$A$1:$B$30,2,FALSE)),\"\",VLOOKUP(O9,' '!$A$1:$B$30,2,FALSE)),VLOOKUP(O9,'  '!$C$5:$D$370,2,FALSE))","v":""},{"$f":"IF(N9=2,1+INT((O9-DATE(YEAR(O9+4-WEEKDAY(O9+6)),1,5)+WEEKDAY(DATE(YEAR(O9+4-WEEKDAY(O9+6)),1,3)))/7),\"\")","v":""},{"$f":"WEEKDAY(S9,1)","v":"1900-01-06"},{"$f":"DATE(T$3,T$4,1)","v":"2019-03-01"},{"$f":"IF(ISERROR(VLOOKUP(S9,'  '!$C$5:$D$370,2,FALSE)),IF(ISERROR(VLOOKUP(S9,' '!$A$1:$B$30,2,FALSE)),\"\",VLOOKUP(S9,' '!$A$1:$B$30,2,FALSE)),VLOOKUP(S9,'  '!$C$5:$D$370,2,FALSE))","v":""},{"$f":"IF(R9=2,1+INT((S9-DATE(YEAR(S9+4-WEEKDAY(S9+6)),1,5)+WEEKDAY(DATE(YEAR(S9+4-WEEKDAY(S9+6)),1,3)))/7),\"\")","v":""},{"$f":"WEEKDAY(W9,1)","v":"1900-01-02"},{"$f":"DATE(X$3,X$4,1)","v":"2019-04-01"},{"$f":"IF(ISERROR(VLOOKUP(W9,'  '!$C$5:$D$370,2,FALSE)),IF(ISERROR(VLOOKUP(W9,' '!$A$1:$B$30,2,FALSE)),\"\",VLOOKUP(W9,' '!$A$1:$B$30,2,FALSE)),VLOOKUP(W9,'  '!$C$5:$D$370,2,FALSE))","v":""},{"$f":"IF(V9=2,1+INT((W9-DATE(YEAR(W9+4-WEEKDAY(W9+6)),1,5)+WEEKDAY(DATE(YEAR(W9+4-WEEKDAY(W9+6)),1,3)))/7),\"\")","v":14}]
[null,{"$f":"WEEKDAY(C10,1)","v":"1900-01-06"},{"$f":"C9+1","v":"2018-11-02"},{"$f":"IF(ISERROR(VLOOKUP(C10,'  '!$C$5:$D$370,2,FALSE)),IF(ISERROR(VLOOKUP(C10,' '!$A$1:$B$30,2,FALSE)),\"\",VLOOKUP(C10,' '!$A$1:$B$30,2,FALSE)),VLOOKUP(C10,'  '!$C$5:$D$370,2,FALSE))","v":""},{"$f":"IF(B10=2,1+INT((C10-DATE(YEAR(C10+4-WEEKDAY(C10+6)),1,5)+WEEKDAY(DATE(YEAR(C10+4-WEEKDAY(C10+6)),1,3)))/7),\"\")","v":""},{"$f":"WEEKDAY(G10,1)","v":"1900-01-01"},{"$f":"G9+1","v":"2018-12-02"},{"$f":"IF(ISERROR(VLOOKUP(G10,'  '!$C$5:$D$370,2,FALSE)),IF(ISERROR(VLOOKUP(G10,' '!$A$1:$B$30,2,FALSE)),\"\",VLOOKUP(G10,' '!$A$1:$B$30,2,FALSE)),VLOOKUP(G10,'  '!$C$5:$D$370,2,FALSE))","v":""},{"$f":"IF(F10=2,1+INT((G10-DATE(YEAR(G10+4-WEEKDAY(G10+6)),1,5)+WEEKDAY(DATE(YEAR(G10+4-WEEKDAY(G10+6)),1,3)))/7),\"\")","v":""},{"$f":"WEEKDAY(K10,1)","v":"1900-01-04"},{"$f":"K9+1","v":"2019-01-02"},{"$f":"IF(ISERROR(VLOOKUP(K10,'  '!$C$5:$D$370,2,FALSE)),IF(ISERROR(VLOOKUP(K10,' '!$A$1:$B$30,2,FALSE)),\"\",VLOOKUP(K10,' '!$A$1:$B$30,2,FALSE)),VLOOKUP(K10,'  '!$C$5:$D$370,2,FALSE))","v":""},{"$f":"IF(J10=2,1+INT((K10-DATE(YEAR(K10+4-WEEKDAY(K10+6)),1,5)+WEEKDAY(DATE(YEAR(K10+4-WEEKDAY(K10+6)),1,3)))/7),\"\")","v":""},{"$f":"WEEKDAY(O10,1)","v":"1900-01-07"},{"$f":"O9+1","v":"2019-02-02"},{"$f":"IF(ISERROR(VLOOKUP(O10,'  '!$C$5:$D$370,2,FALSE)),IF(ISERROR(VLOOKUP(O10,' '!$A$1:$B$30,2,FALSE)),\"\",VLOOKUP(O10,' '!$A$1:$B$30,2,FALSE)),VLOOKUP(O10,'  '!$C$5:$D$370,2,FALSE))","v":""},{"$f":"IF(N10=2,1+INT((O10-DATE(YEAR(O10+4-WEEKDAY(O10+6)),1,5)+WEEKDAY(DATE(YEAR(O10+4-WEEKDAY(O10+6)),1,3)))/7),\"\")","v":""},{"$f":"WEEKDAY(S10,1)","v":"1900-01-07"},{"$f":"S9+1","v":"2019-03-02"},{"$f":"IF(ISERROR(VLOOKUP(S10,'  '!$C$5:$D$370,2,FALSE)),IF(ISERROR(VLOOKUP(S10,' '!$A$1:$B$30,2,FALSE)),\"\",VLOOKUP(S10,' '!$A$1:$B$30,2,FALSE)),VLOOKUP(S10,'  '!$C$5:$D$370,2,FALSE))","v":""},{"$f":"IF(R10=2,1+INT((S10-DATE(YEAR(S10+4-WEEKDAY(S10+6)),1,5)+WEEKDAY(DATE(YEAR(S10+4-WEEKDAY(S10+6)),1,3)))/7),\"\")","v":""},{"$f":"WEEKDAY(W10,1)","v":"1900-01-03"},{"$f":"W9+1","v":"2019-04-02"},{"$f":"IF(ISERROR(VLOOKUP(W10,'  '!$C$5:$D$370,2,FALSE)),IF(ISERROR(VLOOKUP(W10,' '!$A$1:$B$30,2,FALSE)),\"\",VLOOKUP(W10,' '!$A$1:$B$30,2,FALSE)),VLOOKUP(W10,'  '!$C$5:$D$370,2,FALSE))","v":""},{"$f":"IF(V10=2,1+INT((W10-DATE(YEAR(W10+4-WEEKDAY(W10+6)),1,5)+WEEKDAY(DATE(YEAR(W10+4-WEEKDAY(W10+6)),1,3)))/7),\"\")","v":""}]
[null,"1900-01-07",{"$f":"C10+1","v":"2018-11-03"},"Gl. drenge","","1900-01-02",{"$f":"G10+1","v":"2018-12-03"},{"$f":"IF(ISERROR(VLOOKUP(G11,'  '!$C$5:$D$370,2,FALSE)),IF(ISERROR(VLOOKUP(G11,' '!$A$1:$B$30,2,FALSE)),\"\",VLOOKUP(G11,' '!$A$1:$B$30,2,FALSE)),VLOOKUP(G11,'  '!$C$5:$D$370,2,FALSE))","v":""},49,"1900-01-05",{"$f":"K10+1","v":"2019-01-03"},null,"","1900-01-01",{"$f":"O10+1","v":"2019-02-03"},{"$f":"IF(ISERROR(VLOOKUP(O11,'  '!$C$5:$D$370,2,FALSE)),IF(ISERROR(VLOOKUP(O11,' '!$A$1:$B$30,2,FALSE)),\"\",VLOOKUP(O11,' '!$A$1:$B$30,2,FALSE)),VLOOKUP(O11,'  '!$C$5:$D$370,2,FALSE))","v":""},"","1900-01-01",{"$f":"S10+1","v":"2019-03-03"},{"$f":"IF(ISERROR(VLOOKUP(S11,'  '!$C$5:$D$370,2,FALSE)),IF(ISERROR(VLOOKUP(S11,' '!$A$1:$B$30,2,FALSE)),\"\",VLOOKUP(S11,' '!$A$1:$B$30,2,FALSE)),VLOOKUP(S11,'  '!$C$5:$D$370,2,FALSE))","v":""},"","1900-01-04",{"$f":"W10+1","v":"2019-04-03"},{"$f":"IF(ISERROR(VLOOKUP(W11,'  '!$C$5:$D$370,2,FALSE)),IF(ISERROR(VLOOKUP(W11,' '!$A$1:$B$30,2,FALSE)),\"\",VLOOKUP(W11,' '!$A$1:$B$30,2,FALSE)),VLOOKUP(W11,'  '!$C$5:$D$370,2,FALSE))","v":""},""]
[null,"1900-01-01","2018-11-04",{"$f":"IF(ISERROR(VLOOKUP(C12,'  '!$C$5:$D$370,2,FALSE)),IF(ISERROR(VLOOKUP(C12,' '!$A$1:$B$30,2,FALSE)),\"\",VLOOKUP(C12,' '!$A$1:$B$30,2,FALSE)),VLOOKUP(C12,'  '!$C$5:$D$370,2,FALSE))","v":""},"","1900-01-03","2018-12-04",{"$f":"IF(ISERROR(VLOOKUP(G12,'  '!$C$5:$D$370,2,FALSE)),IF(ISERROR(VLOOKUP(G12,' '!$A$1:$B$30,2,FALSE)),\"\",VLOOKUP(G12,' '!$A$1:$B$30,2,FALSE)),VLOOKUP(G12,'  '!$C$5:$D$370,2,FALSE))","v":""},"","1900-01-06","2019-01-04",{"$f":"IF(ISERROR(VLOOKUP(K12,'  '!$C$5:$D$370,2,FALSE)),IF(ISERROR(VLOOKUP(K12,' '!$A$1:$B$30,2,FALSE)),\"\",VLOOKUP(K12,' '!$A$1:$B$30,2,FALSE)),VLOOKUP(K12,'  '!$C$5:$D$370,2,FALSE))","v":""},"","1900-01-02","2019-02-04",{"$f":"IF(ISERROR(VLOOKUP(O12,'  '!$C$5:$D$370,2,FALSE)),IF(ISERROR(VLOOKUP(O12,' '!$A$1:$B$30,2,FALSE)),\"\",VLOOKUP(O12,' '!$A$1:$B$30,2,FALSE)),VLOOKUP(O12,'  '!$C$5:$D$370,2,FALSE))","v":""},6,"1900-01-02","2019-03-04",{"$f":"IF(ISERROR(VLOOKUP(S12,'  '!$C$5:$D$370,2,FALSE)),IF(ISERROR(VLOOKUP(S12,' '!$A$1:$B$30,2,FALSE)),\"\",VLOOKUP(S12,' '!$A$1:$B$30,2,FALSE)),VLOOKUP(S12,'  '!$C$5:$D$370,2,FALSE))","v":""},10,"1900-01-05","2019-04-04",{"$f":"IF(ISERROR(VLOOKUP(W12,'  '!$C$5:$D$370,2,FALSE)),IF(ISERROR(VLOOKUP(W12,' '!$A$1:$B$30,2,FALSE)),\"\",VLOOKUP(W12,' '!$A$1:$B$30,2,FALSE)),VLOOKUP(W12,'  '!$C$5:$D$370,2,FALSE))","v":""},""]
[null,"1900-01-02","2018-11-05",{"$f":"IF(ISERROR(VLOOKUP(C13,'  '!$C$5:$D$370,2,FALSE)),IF(ISERROR(VLOOKUP(C13,' '!$A$1:$B$30,2,FALSE)),\"\",VLOOKUP(C13,' '!$A$1:$B$30,2,FALSE)),VLOOKUP(C13,'  '!$C$5:$D$370,2,FALSE))","v":""},45,"1900-01-04","2018-12-05",{"$f":"IF(ISERROR(VLOOKUP(G13,'  '!$C$5:$D$370,2,FALSE)),IF(ISERROR(VLOOKUP(G13,' '!$A$1:$B$30,2,FALSE)),\"\",VLOOKUP(G13,' '!$A$1:$B$30,2,FALSE)),VLOOKUP(G13,'  '!$C$5:$D$370,2,FALSE))","v":""},"","1900-01-07","2019-01-05",{"$f":"IF(ISERROR(VLOOKUP(K13,'  '!$C$5:$D$370,2,FALSE)),IF(ISERROR(VLOOKUP(K13,' '!$A$1:$B$30,2,FALSE)),\"\",VLOOKUP(K13,' '!$A$1:$B$30,2,FALSE)),VLOOKUP(K13,'  '!$C$5:$D$370,2,FALSE))","v":""},"","1900-01-03","2019-02-05",{"$f":"IF(ISERROR(VLOOKUP(O13,'  '!$C$5:$D$370,2,FALSE)),IF(ISERROR(VLOOKUP(O13,' '!$A$1:$B$30,2,FALSE)),\"\",VLOOKUP(O13,' '!$A$1:$B$30,2,FALSE)),VLOOKUP(O13,'  '!$C$5:$D$370,2,FALSE))","v":""},"","1900-01-03","2019-03-05",{"$f":"IF(ISERROR(VLOOKUP(S13,'  '!$C$5:$D$370,2,FALSE)),IF(ISERROR(VLOOKUP(S13,' '!$A$1:$B$30,2,FALSE)),\"\",VLOOKUP(S13,' '!$A$1:$B$30,2,FALSE)),VLOOKUP(S13,'  '!$C$5:$D$370,2,FALSE))","v":""},"","1900-01-06","2019-04-05",{"$f":"IF(ISERROR(VLOOKUP(W13,'  '!$C$5:$D$370,2,FALSE)),IF(ISERROR(VLOOKUP(W13,' '!$A$1:$B$30,2,FALSE)),\"\",VLOOKUP(W13,' '!$A$1:$B$30,2,FALSE)),VLOOKUP(W13,'  '!$C$5:$D$370,2,FALSE))","v":""},""]
[null,"1900-01-03","2018-11-06",{"$f":"IF(ISERROR(VLOOKUP(C14,'  '!$C$5:$D$370,2,FALSE)),IF(ISERROR(VLOOKUP(C14,' '!$A$1:$B$30,2,FALSE)),\"\",VLOOKUP(C14,' '!$A$1:$B$30,2,FALSE)),VLOOKUP(C14,'  '!$C$5:$D$370,2,FALSE))","v":""},"","1900-01-05","2018-12-06",{"$f":"IF(ISERROR(VLOOKUP(G14,'  '!$C$5:$D$370,2,FALSE)),IF(ISERROR(VLOOKUP(G14,' '!$A$1:$B$30,2,FALSE)),\"\",VLOOKUP(G14,' '!$A$1:$B$30,2,FALSE)),VLOOKUP(G14,'  '!$C$5:$D$370,2,FALSE))","v":""},"","1900-01-01","2019-01-06",{"$f":"IF(ISERROR(VLOOKUP(K14,'  '!$C$5:$D$370,2,FALSE)),IF(ISERROR(VLOOKUP(K14,' '!$A$1:$B$30,2,FALSE)),\"\",VLOOKUP(K14,' '!$A$1:$B$30,2,FALSE)),VLOOKUP(K14,'  '!$C$5:$D$370,2,FALSE))","v":""},"","1900-01-04","2019-02-06",{"$f":"IF(ISERROR(VLOOKUP(O14,'  '!$C$5:$D$370,2,FALSE)),IF(ISERROR(VLOOKUP(O14,' '!$A$1:$B$30,2,FALSE)),\"\",VLOOKUP(O14,' '!$A$1:$B$30,2,FALSE)),VLOOKUP(O14,'  '!$C$5:$D$370,2,FALSE))","v":""},"","1900-01-04","2019-03-06",{"$f":"IF(ISERROR(VLOOKUP(S14,'  '!$C$5:$D$370,2,FALSE)),IF(ISERROR(VLOOKUP(S14,' '!$A$1:$B$30,2,FALSE)),\"\",VLOOKUP(S14,' '!$A$1:$B$30,2,FALSE)),VLOOKUP(S14,'  '!$C$5:$D$370,2,FALSE))","v":""},"","1900-01-07","2019-04-06",{"$f":"IF(ISERROR(VLOOKUP(W14,'  '!$C$5:$D$370,2,FALSE)),IF(ISERROR(VLOOKUP(W14,' '!$A$1:$B$30,2,FALSE)),\"\",VLOOKUP(W14,' '!$A$1:$B$30,2,FALSE)),VLOOKUP(W14,'  '!$C$5:$D$370,2,FALSE))","v":""},""]
[null,"1900-01-04","2018-11-07",{"$f":"IF(ISERROR(VLOOKUP(C15,'  '!$C$5:$D$370,2,FALSE)),IF(ISERROR(VLOOKUP(C15,' '!$A$1:$B$30,2,FALSE)),\"\",VLOOKUP(C15,' '!$A$1:$B$30,2,FALSE)),VLOOKUP(C15,'  '!$C$5:$D$370,2,FALSE))","v":""},"","1900-01-06","2018-12-07",{"$f":"IF(ISERROR(VLOOKUP(G15,'  '!$C$5:$D$370,2,FALSE)),IF(ISERROR(VLOOKUP(G15,' '!$A$1:$B$30,2,FALSE)),\"\",VLOOKUP(G15,' '!$A$1:$B$30,2,FALSE)),VLOOKUP(G15,'  '!$C$5:$D$370,2,FALSE))","v":""},"","1900-01-02","2019-01-07",{"$f":"IF(ISERROR(VLOOKUP(K15,'  '!$C$5:$D$370,2,FALSE)),IF(ISERROR(VLOOKUP(K15,' '!$A$1:$B$30,2,FALSE)),\"\",VLOOKUP(K15,' '!$A$1:$B$30,2,FALSE)),VLOOKUP(K15,'  '!$C$5:$D$370,2,FALSE))","v":""},2,"1900-01-05","2019-02-07",{"$f":"IF(ISERROR(VLOOKUP(O15,'  '!$C$5:$D$370,2,FALSE)),IF(ISERROR(VLOOKUP(O15,' '!$A$1:$B$30,2,FALSE)),\"\",VLOOKUP(O15,' '!$A$1:$B$30,2,FALSE)),VLOOKUP(O15,'  '!$C$5:$D$370,2,FALSE))","v":""},"","1900-01-05","2019-03-07",{"$f":"IF(ISERROR(VLOOKUP(S15,'  '!$C$5:$D$370,2,FALSE)),IF(ISERROR(VLOOKUP(S15,' '!$A$1:$B$30,2,FALSE)),\"\",VLOOKUP(S15,' '!$A$1:$B$30,2,FALSE)),VLOOKUP(S15,'  '!$C$5:$D$370,2,FALSE))","v":""},"","1900-01-01","2019-04-07",{"$f":"IF(ISERROR(VLOOKUP(W15,'  '!$C$5:$D$370,2,FALSE)),IF(ISERROR(VLOOKUP(W15,' '!$A$1:$B$30,2,FALSE)),\"\",VLOOKUP(W15,' '!$A$1:$B$30,2,FALSE)),VLOOKUP(W15,'  '!$C$5:$D$370,2,FALSE))","v":""},""]
[null,"1900-01-05","2018-11-08",{"$f":"IF(ISERROR(VLOOKUP(C16,'  '!$C$5:$D$370,2,FALSE)),IF(ISERROR(VLOOKUP(C16,' '!$A$1:$B$30,2,FALSE)),\"\",VLOOKUP(C16,' '!$A$1:$B$30,2,FALSE)),VLOOKUP(C16,'  '!$C$5:$D$370,2,FALSE))","v":""},"","1900-01-07","2018-12-08",{"$f":"IF(ISERROR(VLOOKUP(G16,'  '!$C$5:$D$370,2,FALSE)),IF(ISERROR(VLOOKUP(G16,' '!$A$1:$B$30,2,FALSE)),\"\",VLOOKUP(G16,' '!$A$1:$B$30,2,FALSE)),VLOOKUP(G16,'  '!$C$5:$D$370,2,FALSE))","v":""},"","1900-01-03","2019-01-08",{"$f":"IF(ISERROR(VLOOKUP(K16,'  '!$C$5:$D$370,2,FALSE)),IF(ISERROR(VLOOKUP(K16,' '!$A$1:$B$30,2,FALSE)),\"\",VLOOKUP(K16,' '!$A$1:$B$30,2,FALSE)),VLOOKUP(K16,'  '!$C$5:$D$370,2,FALSE))","v":""},"","1900-01-06","2019-02-08",{"$f":"IF(ISERROR(VLOOKUP(O16,'  '!$C$5:$D$370,2,FALSE)),IF(ISERROR(VLOOKUP(O16,' '!$A$1:$B$30,2,FALSE)),\"\",VLOOKUP(O16,' '!$A$1:$B$30,2,FALSE)),VLOOKUP(O16,'  '!$C$5:$D$370,2,FALSE))","v":""},"","1900-01-06","2019-03-08",{"$f":"IF(ISERROR(VLOOKUP(S16,'  '!$C$5:$D$370,2,FALSE)),IF(ISERROR(VLOOKUP(S16,' '!$A$1:$B$30,2,FALSE)),\"\",VLOOKUP(S16,' '!$A$1:$B$30,2,FALSE)),VLOOKUP(S16,'  '!$C$5:$D$370,2,FALSE))","v":""},"","1900-01-02","2019-04-08",{"$f":"IF(ISERROR(VLOOKUP(W16,'  '!$C$5:$D$370,2,FALSE)),IF(ISERROR(VLOOKUP(W16,' '!$A$1:$B$30,2,FALSE)),\"\",VLOOKUP(W16,' '!$A$1:$B$30,2,FALSE)),VLOOKUP(W16,'  '!$C$5:$D$370,2,FALSE))","v":""},15]
[null,"1900-01-06","2018-11-09",{"$f":"IF(ISERROR(VLOOKUP(C17,'  '!$C$5:$D$370,2,FALSE)),IF(ISERROR(VLOOKUP(C17,' '!$A$1:$B$30,2,FALSE)),\"\",VLOOKUP(C17,' '!$A$1:$B$30,2,FALSE)),VLOOKUP(C17,'  '!$C$5:$D$370,2,FALSE))","v":""},"","1900-01-01","2018-12-09",{"$f":"IF(ISERROR(VLOOKUP(G17,'  '!$C$5:$D$370,2,FALSE)),IF(ISERROR(VLOOKUP(G17,' '!$A$1:$B$30,2,FALSE)),\"\",VLOOKUP(G17,' '!$A$1:$B$30,2,FALSE)),VLOOKUP(G17,'  '!$C$5:$D$370,2,FALSE))","v":""},"","1900-01-04","2019-01-09",{"$f":"IF(ISERROR(VLOOKUP(K17,'  '!$C$5:$D$370,2,FALSE)),IF(ISERROR(VLOOKUP(K17,' '!$A$1:$B$30,2,FALSE)),\"\",VLOOKUP(K17,' '!$A$1:$B$30,2,FALSE)),VLOOKUP(K17,'  '!$C$5:$D$370,2,FALSE))","v":""},"","1900-01-07","2019-02-09",{"$f":"IF(ISERROR(VLOOKUP(O17,'  '!$C$5:$D$370,2,FALSE)),IF(ISERROR(VLOOKUP(O17,' '!$A$1:$B$30,2,FALSE)),\"\",VLOOKUP(O17,' '!$A$1:$B$30,2,FALSE)),VLOOKUP(O17,'  '!$C$5:$D$370,2,FALSE))","v":""},"","1900-01-07","2019-03-09",{"$f":"IF(ISERROR(VLOOKUP(S17,'  '!$C$5:$D$370,2,FALSE)),IF(ISERROR(VLOOKUP(S17,' '!$A$1:$B$30,2,FALSE)),\"\",VLOOKUP(S17,' '!$A$1:$B$30,2,FALSE)),VLOOKUP(S17,'  '!$C$5:$D$370,2,FALSE))","v":""},"","1900-01-03","2019-04-09",{"$f":"IF(ISERROR(VLOOKUP(W17,'  '!$C$5:$D$370,2,FALSE)),IF(ISERROR(VLOOKUP(W17,' '!$A$1:$B$30,2,FALSE)),\"\",VLOOKUP(W17,' '!$A$1:$B$30,2,FALSE)),VLOOKUP(W17,'  '!$C$5:$D$370,2,FALSE))","v":""},""]
[null,"1900-01-07","2018-11-10",{"$f":"IF(ISERROR(VLOOKUP(C18,'  '!$C$5:$D$370,2,FALSE)),IF(ISERROR(VLOOKUP(C18,' '!$A$1:$B$30,2,FALSE)),\"\",VLOOKUP(C18,' '!$A$1:$B$30,2,FALSE)),VLOOKUP(C18,'  '!$C$5:$D$370,2,FALSE))","v":""},"","1900-01-02","2018-12-10",{"$f":"IF(ISERROR(VLOOKUP(G18,'  '!$C$5:$D$370,2,FALSE)),IF(ISERROR(VLOOKUP(G18,' '!$A$1:$B$30,2,FALSE)),\"\",VLOOKUP(G18,' '!$A$1:$B$30,2,FALSE)),VLOOKUP(G18,'  '!$C$5:$D$370,2,FALSE))","v":""},50,"1900-01-05","2019-01-10",{"$f":"IF(ISERROR(VLOOKUP(K18,'  '!$C$5:$D$370,2,FALSE)),IF(ISERROR(VLOOKUP(K18,' '!$A$1:$B$30,2,FALSE)),\"\",VLOOKUP(K18,' '!$A$1:$B$30,2,FALSE)),VLOOKUP(K18,'  '!$C$5:$D$370,2,FALSE))","v":""},"","1900-01-01","2019-02-10",{"$f":"IF(ISERROR(VLOOKUP(O18,'  '!$C$5:$D$370,2,FALSE)),IF(ISERROR(VLOOKUP(O18,' '!$A$1:$B$30,2,FALSE)),\"\",VLOOKUP(O18,' '!$A$1:$B$30,2,FALSE)),VLOOKUP(O18,'  '!$C$5:$D$370,2,FALSE))","v":""},"","1900-01-01","2019-03-10",{"$f":"IF(ISERROR(VLOOKUP(S18,'  '!$C$5:$D$370,2,FALSE)),IF(ISERROR(VLOOKUP(S18,' '!$A$1:$B$30,2,FALSE)),\"\",VLOOKUP(S18,' '!$A$1:$B$30,2,FALSE)),VLOOKUP(S18,'  '!$C$5:$D$370,2,FALSE))","v":""},"","1900-01-04","2019-04-10",{"$f":"IF(ISERROR(VLOOKUP(W18,'  '!$C$5:$D$370,2,FALSE)),IF(ISERROR(VLOOKUP(W18,' '!$A$1:$B$30,2,FALSE)),\"\",VLOOKUP(W18,' '!$A$1:$B$30,2,FALSE)),VLOOKUP(W18,'  '!$C$5:$D$370,2,FALSE))","v":""},""]
[null,"1900-01-01","2018-11-11",{"$f":"IF(ISERROR(VLOOKUP(C19,'  '!$C$5:$D$370,2,FALSE)),IF(ISERROR(VLOOKUP(C19,' '!$A$1:$B$30,2,FALSE)),\"\",VLOOKUP(C19,' '!$A$1:$B$30,2,FALSE)),VLOOKUP(C19,'  '!$C$5:$D$370,2,FALSE))","v":""},"","1900-01-03","2018-12-11",{"$f":"IF(ISERROR(VLOOKUP(G19,'  '!$C$5:$D$370,2,FALSE)),IF(ISERROR(VLOOKUP(G19,' '!$A$1:$B$30,2,FALSE)),\"\",VLOOKUP(G19,' '!$A$1:$B$30,2,FALSE)),VLOOKUP(G19,'  '!$C$5:$D$370,2,FALSE))","v":""},"","1900-01-06","2019-01-11",{"$f":"IF(ISERROR(VLOOKUP(K19,'  '!$C$5:$D$370,2,FALSE)),IF(ISERROR(VLOOKUP(K19,' '!$A$1:$B$30,2,FALSE)),\"\",VLOOKUP(K19,' '!$A$1:$B$30,2,FALSE)),VLOOKUP(K19,'  '!$C$5:$D$370,2,FALSE))","v":""},"","1900-01-02","2019-02-11",{"$f":"IF(ISERROR(VLOOKUP(O19,'  '!$C$5:$D$370,2,FALSE)),IF(ISERROR(VLOOKUP(O19,' '!$A$1:$B$30,2,FALSE)),\"\",VLOOKUP(O19,' '!$A$1:$B$30,2,FALSE)),VLOOKUP(O19,'  '!$C$5:$D$370,2,FALSE))","v":""},7,"1900-01-02","2019-03-11",{"$f":"IF(ISERROR(VLOOKUP(S19,'  '!$C$5:$D$370,2,FALSE)),IF(ISERROR(VLOOKUP(S19,' '!$A$1:$B$30,2,FALSE)),\"\",VLOOKUP(S19,' '!$A$1:$B$30,2,FALSE)),VLOOKUP(S19,'  '!$C$5:$D$370,2,FALSE))","v":""},11,"1900-01-05","2019-04-11",{"$f":"IF(ISERROR(VLOOKUP(W19,'  '!$C$5:$D$370,2,FALSE)),IF(ISERROR(VLOOKUP(W19,' '!$A$1:$B$30,2,FALSE)),\"\",VLOOKUP(W19,' '!$A$1:$B$30,2,FALSE)),VLOOKUP(W19,'  '!$C$5:$D$370,2,FALSE))","v":""},""]
[null,"1900-01-02","2018-11-12",{"$f":"IF(ISERROR(VLOOKUP(C20,'  '!$C$5:$D$370,2,FALSE)),IF(ISERROR(VLOOKUP(C20,' '!$A$1:$B$30,2,FALSE)),\"\",VLOOKUP(C20,' '!$A$1:$B$30,2,FALSE)),VLOOKUP(C20,'  '!$C$5:$D$370,2,FALSE))","v":""},46,"1900-01-04","2018-12-12",{"$f":"IF(ISERROR(VLOOKUP(G20,'  '!$C$5:$D$370,2,FALSE)),IF(ISERROR(VLOOKUP(G20,' '!$A$1:$B$30,2,FALSE)),\"\",VLOOKUP(G20,' '!$A$1:$B$30,2,FALSE)),VLOOKUP(G20,'  '!$C$5:$D$370,2,FALSE))","v":""},"","1900-01-07","2019-01-12",{"$f":"IF(ISERROR(VLOOKUP(K20,'  '!$C$5:$D$370,2,FALSE)),IF(ISERROR(VLOOKUP(K20,' '!$A$1:$B$30,2,FALSE)),\"\",VLOOKUP(K20,' '!$A$1:$B$30,2,FALSE)),VLOOKUP(K20,'  '!$C$5:$D$370,2,FALSE))","v":""},"","1900-01-03","2019-02-12",{"$f":"IF(ISERROR(VLOOKUP(O20,'  '!$C$5:$D$370,2,FALSE)),IF(ISERROR(VLOOKUP(O20,' '!$A$1:$B$30,2,FALSE)),\"\",VLOOKUP(O20,' '!$A$1:$B$30,2,FALSE)),VLOOKUP(O20,'  '!$C$5:$D$370,2,FALSE))","v":""},"","1900-01-03","2019-03-12",{"$f":"IF(ISERROR(VLOOKUP(S20,'  '!$C$5:$D$370,2,FALSE)),IF(ISERROR(VLOOKUP(S20,' '!$A$1:$B$30,2,FALSE)),\"\",VLOOKUP(S20,' '!$A$1:$B$30,2,FALSE)),VLOOKUP(S20,'  '!$C$5:$D$370,2,FALSE))","v":""},"","1900-01-06","2019-04-12",{"$f":"IF(ISERROR(VLOOKUP(W20,'  '!$C$5:$D$370,2,FALSE)),IF(ISERROR(VLOOKUP(W20,' '!$A$1:$B$30,2,FALSE)),\"\",VLOOKUP(W20,' '!$A$1:$B$30,2,FALSE)),VLOOKUP(W20,'  '!$C$5:$D$370,2,FALSE))","v":""},""]
[null,"1900-01-03","2018-11-13",{"$f":"IF(ISERROR(VLOOKUP(C21,'  '!$C$5:$D$370,2,FALSE)),IF(ISERROR(VLOOKUP(C21,' '!$A$1:$B$30,2,FALSE)),\"\",VLOOKUP(C21,' '!$A$1:$B$30,2,FALSE)),VLOOKUP(C21,'  '!$C$5:$D$370,2,FALSE))","v":""},"","1900-01-05","2018-12-13",{"$f":"IF(ISERROR(VLOOKUP(G21,'  '!$C$5:$D$370,2,FALSE)),IF(ISERROR(VLOOKUP(G21,' '!$A$1:$B$30,2,FALSE)),\"\",VLOOKUP(G21,' '!$A$1:$B$30,2,FALSE)),VLOOKUP(G21,'  '!$C$5:$D$370,2,FALSE))","v":""},"","1900-01-01","2019-01-13",{"$f":"IF(ISERROR(VLOOKUP(K21,'  '!$C$5:$D$370,2,FALSE)),IF(ISERROR(VLOOKUP(K21,' '!$A$1:$B$30,2,FALSE)),\"\",VLOOKUP(K21,' '!$A$1:$B$30,2,FALSE)),VLOOKUP(K21,'  '!$C$5:$D$370,2,FALSE))","v":""},"","1900-01-04","2019-02-13",{"$f":"IF(ISERROR(VLOOKUP(O21,'  '!$C$5:$D$370,2,FALSE)),IF(ISERROR(VLOOKUP(O21,' '!$A$1:$B$30,2,FALSE)),\"\",VLOOKUP(O21,' '!$A$1:$B$30,2,FALSE)),VLOOKUP(O21,'  '!$C$5:$D$370,2,FALSE))","v":""},"","1900-01-04","2019-03-13",null,"","1900-01-07","2019-04-13",{"$f":"IF(ISERROR(VLOOKUP(W21,'  '!$C$5:$D$370,2,FALSE)),IF(ISERROR(VLOOKUP(W21,' '!$A$1:$B$30,2,FALSE)),\"\",VLOOKUP(W21,' '!$A$1:$B$30,2,FALSE)),VLOOKUP(W21,'  '!$C$5:$D$370,2,FALSE))","v":""},""]
[null,"1900-01-04","2018-11-14",null,"","1900-01-06","2018-12-14",{"$f":"IF(ISERROR(VLOOKUP(G22,'  '!$C$5:$D$370,2,FALSE)),IF(ISERROR(VLOOKUP(G22,' '!$A$1:$B$30,2,FALSE)),\"\",VLOOKUP(G22,' '!$A$1:$B$30,2,FALSE)),VLOOKUP(G22,'  '!$C$5:$D$370,2,FALSE))","v":""},"","1900-01-02","2019-01-14",{"$f":"IF(ISERROR(VLOOKUP(K22,'  '!$C$5:$D$370,2,FALSE)),IF(ISERROR(VLOOKUP(K22,' '!$A$1:$B$30,2,FALSE)),\"\",VLOOKUP(K22,' '!$A$1:$B$30,2,FALSE)),VLOOKUP(K22,'  '!$C$5:$D$370,2,FALSE))","v":""},3,"1900-01-05","2019-02-14",{"$f":"IF(ISERROR(VLOOKUP(O22,'  '!$C$5:$D$370,2,FALSE)),IF(ISERROR(VLOOKUP(O22,' '!$A$1:$B$30,2,FALSE)),\"\",VLOOKUP(O22,' '!$A$1:$B$30,2,FALSE)),VLOOKUP(O22,'  '!$C$5:$D$370,2,FALSE))","v":""},"","1900-01-05","2019-03-14",{"$f":"IF(ISERROR(VLOOKUP(S22,'  '!$C$5:$D$370,2,FALSE)),IF(ISERROR(VLOOKUP(S22,' '!$A$1:$B$30,2,FALSE)),\"\",VLOOKUP(S22,' '!$A$1:$B$30,2,FALSE)),VLOOKUP(S22,'  '!$C$5:$D$370,2,FALSE))","v":""},"","1900-01-01","2019-04-14",{"$f":"IF(ISERROR(VLOOKUP(W22,'  '!$C$5:$D$370,2,FALSE)),IF(ISERROR(VLOOKUP(W22,' '!$A$1:$B$30,2,FALSE)),\"\",VLOOKUP(W22,' '!$A$1:$B$30,2,FALSE)),VLOOKUP(W22,'  '!$C$5:$D$370,2,FALSE))","v":"Palmesøndag"},""]
[null,"1900-01-05","2018-11-15",{"$f":"IF(ISERROR(VLOOKUP(C23,'  '!$C$5:$D$370,2,FALSE)),IF(ISERROR(VLOOKUP(C23,' '!$A$1:$B$30,2,FALSE)),\"\",VLOOKUP(C23,' '!$A$1:$B$30,2,FALSE)),VLOOKUP(C23,'  '!$C$5:$D$370,2,FALSE))","v":""},"","1900-01-07","2018-12-15",null,"","1900-01-03","2019-01-15",{"$f":"IF(ISERROR(VLOOKUP(K23,'  '!$C$5:$D$370,2,FALSE)),IF(ISERROR(VLOOKUP(K23,' '!$A$1:$B$30,2,FALSE)),\"\",VLOOKUP(K23,' '!$A$1:$B$30,2,FALSE)),VLOOKUP(K23,'  '!$C$5:$D$370,2,FALSE))","v":""},"","1900-01-06","2019-02-15",{"$f":"IF(ISERROR(VLOOKUP(O23,'  '!$C$5:$D$370,2,FALSE)),IF(ISERROR(VLOOKUP(O23,' '!$A$1:$B$30,2,FALSE)),\"\",VLOOKUP(O23,' '!$A$1:$B$30,2,FALSE)),VLOOKUP(O23,'  '!$C$5:$D$370,2,FALSE))","v":""},"","1900-01-06","2019-03-15",{"$f":"IF(ISERROR(VLOOKUP(S23,'  '!$C$5:$D$370,2,FALSE)),IF(ISERROR(VLOOKUP(S23,' '!$A$1:$B$30,2,FALSE)),\"\",VLOOKUP(S23,' '!$A$1:$B$30,2,FALSE)),VLOOKUP(S23,'  '!$C$5:$D$370,2,FALSE))","v":""},"","1900-01-02","2019-04-15",{"$f":"IF(ISERROR(VLOOKUP(W23,'  '!$C$5:$D$370,2,FALSE)),IF(ISERROR(VLOOKUP(W23,' '!$A$1:$B$30,2,FALSE)),\"\",VLOOKUP(W23,' '!$A$1:$B$30,2,FALSE)),VLOOKUP(W23,'  '!$C$5:$D$370,2,FALSE))","v":""},16]
[null,"1900-01-06","2018-11-16",{"$f":"IF(ISERROR(VLOOKUP(C24,'  '!$C$5:$D$370,2,FALSE)),IF(ISERROR(VLOOKUP(C24,' '!$A$1:$B$30,2,FALSE)),\"\",VLOOKUP(C24,' '!$A$1:$B$30,2,FALSE)),VLOOKUP(C24,'  '!$C$5:$D$370,2,FALSE))","v":""},"","1900-01-01","2018-12-16",null,"","1900-01-04","2019-01-16",{"$f":"IF(ISERROR(VLOOKUP(K24,'  '!$C$5:$D$370,2,FALSE)),IF(ISERROR(VLOOKUP(K24,' '!$A$1:$B$30,2,FALSE)),\"\",VLOOKUP(K24,' '!$A$1:$B$30,2,FALSE)),VLOOKUP(K24,'  '!$C$5:$D$370,2,FALSE))","v":""},"","1900-01-07","2019-02-16",{"$f":"IF(ISERROR(VLOOKUP(O24,'  '!$C$5:$D$370,2,FALSE)),IF(ISERROR(VLOOKUP(O24,' '!$A$1:$B$30,2,FALSE)),\"\",VLOOKUP(O24,' '!$A$1:$B$30,2,FALSE)),VLOOKUP(O24,'  '!$C$5:$D$370,2,FALSE))","v":""},"","1900-01-07","2019-03-16",{"$f":"IF(ISERROR(VLOOKUP(S24,'  '!$C$5:$D$370,2,FALSE)),IF(ISERROR(VLOOKUP(S24,' '!$A$1:$B$30,2,FALSE)),\"\",VLOOKUP(S24,' '!$A$1:$B$30,2,FALSE)),VLOOKUP(S24,'  '!$C$5:$D$370,2,FALSE))","v":""},"","1900-01-03","2019-04-16",{"$f":"IF(ISERROR(VLOOKUP(W24,'  '!$C$5:$D$370,2,FALSE)),IF(ISERROR(VLOOKUP(W24,' '!$A$1:$B$30,2,FALSE)),\"\",VLOOKUP(W24,' '!$A$1:$B$30,2,FALSE)),VLOOKUP(W24,'  '!$C$5:$D$370,2,FALSE))","v":""},""]
[null,"1900-01-07","2018-11-17",{"$f":"IF(ISERROR(VLOOKUP(C25,'  '!$C$5:$D$370,2,FALSE)),IF(ISERROR(VLOOKUP(C25,' '!$A$1:$B$30,2,FALSE)),\"\",VLOOKUP(C25,' '!$A$1:$B$30,2,FALSE)),VLOOKUP(C25,'  '!$C$5:$D$370,2,FALSE))","v":""},"","1900-01-02","2018-12-17",{"$f":"IF(ISERROR(VLOOKUP(G25,'  '!$C$5:$D$370,2,FALSE)),IF(ISERROR(VLOOKUP(G25,' '!$A$1:$B$30,2,FALSE)),\"\",VLOOKUP(G25,' '!$A$1:$B$30,2,FALSE)),VLOOKUP(G25,'  '!$C$5:$D$370,2,FALSE))","v":""},51,"1900-01-05","2019-01-17",{"$f":"IF(ISERROR(VLOOKUP(K25,'  '!$C$5:$D$370,2,FALSE)),IF(ISERROR(VLOOKUP(K25,' '!$A$1:$B$30,2,FALSE)),\"\",VLOOKUP(K25,' '!$A$1:$B$30,2,FALSE)),VLOOKUP(K25,'  '!$C$5:$D$370,2,FALSE))","v":""},"","1900-01-01","2019-02-17",{"$f":"IF(ISERROR(VLOOKUP(O25,'  '!$C$5:$D$370,2,FALSE)),IF(ISERROR(VLOOKUP(O25,' '!$A$1:$B$30,2,FALSE)),\"\",VLOOKUP(O25,' '!$A$1:$B$30,2,FALSE)),VLOOKUP(O25,'  '!$C$5:$D$370,2,FALSE))","v":""},"","1900-01-01","2019-03-17",{"$f":"IF(ISERROR(VLOOKUP(S25,'  '!$C$5:$D$370,2,FALSE)),IF(ISERROR(VLOOKUP(S25,' '!$A$1:$B$30,2,FALSE)),\"\",VLOOKUP(S25,' '!$A$1:$B$30,2,FALSE)),VLOOKUP(S25,'  '!$C$5:$D$370,2,FALSE))","v":""},"","1900-01-04","2019-04-17",{"$f":"IF(ISERROR(VLOOKUP(W25,'  '!$C$5:$D$370,2,FALSE)),IF(ISERROR(VLOOKUP(W25,' '!$A$1:$B$30,2,FALSE)),\"\",VLOOKUP(W25,' '!$A$1:$B$30,2,FALSE)),VLOOKUP(W25,'  '!$C$5:$D$370,2,FALSE))","v":""},""]
[null,"1900-01-01","2018-11-18",{"$f":"IF(ISERROR(VLOOKUP(C26,'  '!$C$5:$D$370,2,FALSE)),IF(ISERROR(VLOOKUP(C26,' '!$A$1:$B$30,2,FALSE)),\"\",VLOOKUP(C26,' '!$A$1:$B$30,2,FALSE)),VLOOKUP(C26,'  '!$C$5:$D$370,2,FALSE))","v":""},"","1900-01-03","2018-12-18",{"$f":"IF(ISERROR(VLOOKUP(G26,'  '!$C$5:$D$370,2,FALSE)),IF(ISERROR(VLOOKUP(G26,' '!$A$1:$B$30,2,FALSE)),\"\",VLOOKUP(G26,' '!$A$1:$B$30,2,FALSE)),VLOOKUP(G26,'  '!$C$5:$D$370,2,FALSE))","v":""},"","1900-01-06","2019-01-18","Træner/Leder fest","","1900-01-02","2019-02-18",{"$f":"IF(ISERROR(VLOOKUP(O26,'  '!$C$5:$D$370,2,FALSE)),IF(ISERROR(VLOOKUP(O26,' '!$A$1:$B$30,2,FALSE)),\"\",VLOOKUP(O26,' '!$A$1:$B$30,2,FALSE)),VLOOKUP(O26,'  '!$C$5:$D$370,2,FALSE))","v":""},8,"1900-01-02","2019-03-18",null,12,"1900-01-05","2019-04-18",{"$f":"IF(ISERROR(VLOOKUP(W26,'  '!$C$5:$D$370,2,FALSE)),IF(ISERROR(VLOOKUP(W26,' '!$A$1:$B$30,2,FALSE)),\"\",VLOOKUP(W26,' '!$A$1:$B$30,2,FALSE)),VLOOKUP(W26,'  '!$C$5:$D$370,2,FALSE))","v":"Skærtorsdag"},""]
[null,"1900-01-02","2018-11-19",{"$f":"IF(ISERROR(VLOOKUP(C27,'  '!$C$5:$D$370,2,FALSE)),IF(ISERROR(VLOOKUP(C27,' '!$A$1:$B$30,2,FALSE)),\"\",VLOOKUP(C27,' '!$A$1:$B$30,2,FALSE)),VLOOKUP(C27,'  '!$C$5:$D$370,2,FALSE))","v":""},47,"1900-01-04","2018-12-19",{"$f":"IF(ISERROR(VLOOKUP(G27,'  '!$C$5:$D$370,2,FALSE)),IF(ISERROR(VLOOKUP(G27,' '!$A$1:$B$30,2,FALSE)),\"\",VLOOKUP(G27,' '!$A$1:$B$30,2,FALSE)),VLOOKUP(G27,'  '!$C$5:$D$370,2,FALSE))","v":""},"","1900-01-07","2019-01-19",{"$f":"IF(ISERROR(VLOOKUP(K27,'  '!$C$5:$D$370,2,FALSE)),IF(ISERROR(VLOOKUP(K27,' '!$A$1:$B$30,2,FALSE)),\"\",VLOOKUP(K27,' '!$A$1:$B$30,2,FALSE)),VLOOKUP(K27,'  '!$C$5:$D$370,2,FALSE))","v":""},"","1900-01-03","2019-02-19",{"$f":"IF(ISERROR(VLOOKUP(O27,'  '!$C$5:$D$370,2,FALSE)),IF(ISERROR(VLOOKUP(O27,' '!$A$1:$B$30,2,FALSE)),\"\",VLOOKUP(O27,' '!$A$1:$B$30,2,FALSE)),VLOOKUP(O27,'  '!$C$5:$D$370,2,FALSE))","v":""},"","1900-01-03","2019-03-19","Generalforsamling","","1900-01-06","2019-04-19",{"$f":"IF(ISERROR(VLOOKUP(W27,'  '!$C$5:$D$370,2,FALSE)),IF(ISERROR(VLOOKUP(W27,' '!$A$1:$B$30,2,FALSE)),\"\",VLOOKUP(W27,' '!$A$1:$B$30,2,FALSE)),VLOOKUP(W27,'  '!$C$5:$D$370,2,FALSE))","v":"Langfredag"},""]
[null,"1900-01-03","2018-11-20",{"$f":"IF(ISERROR(VLOOKUP(C28,'  '!$C$5:$D$370,2,FALSE)),IF(ISERROR(VLOOKUP(C28,' '!$A$1:$B$30,2,FALSE)),\"\",VLOOKUP(C28,' '!$A$1:$B$30,2,FALSE)),VLOOKUP(C28,'  '!$C$5:$D$370,2,FALSE))","v":""},"","1900-01-05","2018-12-20",{"$f":"IF(ISERROR(VLOOKUP(G28,'  '!$C$5:$D$370,2,FALSE)),IF(ISERROR(VLOOKUP(G28,' '!$A$1:$B$30,2,FALSE)),\"\",VLOOKUP(G28,' '!$A$1:$B$30,2,FALSE)),VLOOKUP(G28,'  '!$C$5:$D$370,2,FALSE))","v":""},"","1900-01-01","2019-01-20","standerhejsning","","1900-01-04","2019-02-20",{"$f":"IF(ISERROR(VLOOKUP(O28,'  '!$C$5:$D$370,2,FALSE)),IF(ISERROR(VLOOKUP(O28,' '!$A$1:$B$30,2,FALSE)),\"\",VLOOKUP(O28,' '!$A$1:$B$30,2,FALSE)),VLOOKUP(O28,'  '!$C$5:$D$370,2,FALSE))","v":""},"","1900-01-04","2019-03-20",null,"","1900-01-07","2019-04-20",{"$f":"IF(ISERROR(VLOOKUP(W28,'  '!$C$5:$D$370,2,FALSE)),IF(ISERROR(VLOOKUP(W28,' '!$A$1:$B$30,2,FALSE)),\"\",VLOOKUP(W28,' '!$A$1:$B$30,2,FALSE)),VLOOKUP(W28,'  '!$C$5:$D$370,2,FALSE))","v":""},""]
[null,"1900-01-04","2018-11-21",{"$f":"IF(ISERROR(VLOOKUP(C29,'  '!$C$5:$D$370,2,FALSE)),IF(ISERROR(VLOOKUP(C29,' '!$A$1:$B$30,2,FALSE)),\"\",VLOOKUP(C29,' '!$A$1:$B$30,2,FALSE)),VLOOKUP(C29,'  '!$C$5:$D$370,2,FALSE))","v":""},"","1900-01-06","2018-12-21",{"$f":"IF(ISERROR(VLOOKUP(G29,'  '!$C$5:$D$370,2,FALSE)),IF(ISERROR(VLOOKUP(G29,' '!$A$1:$B$30,2,FALSE)),\"\",VLOOKUP(G29,' '!$A$1:$B$30,2,FALSE)),VLOOKUP(G29,'  '!$C$5:$D$370,2,FALSE))","v":""},"","1900-01-02","2019-01-21",{"$f":"IF(ISERROR(VLOOKUP(K29,'  '!$C$5:$D$370,2,FALSE)),IF(ISERROR(VLOOKUP(K29,' '!$A$1:$B$30,2,FALSE)),\"\",VLOOKUP(K29,' '!$A$1:$B$30,2,FALSE)),VLOOKUP(K29,'  '!$C$5:$D$370,2,FALSE))","v":""},4,"1900-01-05","2019-02-21",{"$f":"IF(ISERROR(VLOOKUP(O29,'  '!$C$5:$D$370,2,FALSE)),IF(ISERROR(VLOOKUP(O29,' '!$A$1:$B$30,2,FALSE)),\"\",VLOOKUP(O29,' '!$A$1:$B$30,2,FALSE)),VLOOKUP(O29,'  '!$C$5:$D$370,2,FALSE))","v":""},"","1900-01-05","2019-03-21",{"$f":"IF(ISERROR(VLOOKUP(S29,'  '!$C$5:$D$370,2,FALSE)),IF(ISERROR(VLOOKUP(S29,' '!$A$1:$B$30,2,FALSE)),\"\",VLOOKUP(S29,' '!$A$1:$B$30,2,FALSE)),VLOOKUP(S29,'  '!$C$5:$D$370,2,FALSE))","v":""},"","1900-01-01","2019-04-21",{"$f":"IF(ISERROR(VLOOKUP(W29,'  '!$C$5:$D$370,2,FALSE)),IF(ISERROR(VLOOKUP(W29,' '!$A$1:$B$30,2,FALSE)),\"\",VLOOKUP(W29,' '!$A$1:$B$30,2,FALSE)),VLOOKUP(W29,'  '!$C$5:$D$370,2,FALSE))","v":"Påskedag"},""]
[null,"1900-01-05","2018-11-22",{"$f":"IF(ISERROR(VLOOKUP(C30,'  '!$C$5:$D$370,2,FALSE)),IF(ISERROR(VLOOKUP(C30,' '!$A$1:$B$30,2,FALSE)),\"\",VLOOKUP(C30,' '!$A$1:$B$30,2,FALSE)),VLOOKUP(C30,'  '!$C$5:$D$370,2,FALSE))","v":""},"","1900-01-07","2018-12-22",{"$f":"IF(ISERROR(VLOOKUP(G30,'  '!$C$5:$D$370,2,FALSE)),IF(ISERROR(VLOOKUP(G30,' '!$A$1:$B$30,2,FALSE)),\"\",VLOOKUP(G30,' '!$A$1:$B$30,2,FALSE)),VLOOKUP(G30,'  '!$C$5:$D$370,2,FALSE))","v":""},"","1900-01-03","2019-01-22",{"$f":"IF(ISERROR(VLOOKUP(K30,'  '!$C$5:$D$370,2,FALSE)),IF(ISERROR(VLOOKUP(K30,' '!$A$1:$B$30,2,FALSE)),\"\",VLOOKUP(K30,' '!$A$1:$B$30,2,FALSE)),VLOOKUP(K30,'  '!$C$5:$D$370,2,FALSE))","v":""},"","1900-01-06","2019-02-22",{"$f":"IF(ISERROR(VLOOKUP(O30,'  '!$C$5:$D$370,2,FALSE)),IF(ISERROR(VLOOKUP(O30,' '!$A$1:$B$30,2,FALSE)),\"\",VLOOKUP(O30,' '!$A$1:$B$30,2,FALSE)),VLOOKUP(O30,'  '!$C$5:$D$370,2,FALSE))","v":""},"","1900-01-06","2019-03-22",{"$f":"IF(ISERROR(VLOOKUP(S30,'  '!$C$5:$D$370,2,FALSE)),IF(ISERROR(VLOOKUP(S30,' '!$A$1:$B$30,2,FALSE)),\"\",VLOOKUP(S30,' '!$A$1:$B$30,2,FALSE)),VLOOKUP(S30,'  '!$C$5:$D$370,2,FALSE))","v":""},"","1900-01-02","2019-04-22",{"$f":"IF(ISERROR(VLOOKUP(W30,'  '!$C$5:$D$370,2,FALSE)),IF(ISERROR(VLOOKUP(W30,' '!$A$1:$B$30,2,FALSE)),\"\",VLOOKUP(W30,' '!$A$1:$B$30,2,FALSE)),VLOOKUP(W30,'  '!$C$5:$D$370,2,FALSE))","v":"2. påskedag"},17]
[null,"1900-01-06","2018-11-23",{"$f":"IF(ISERROR(VLOOKUP(C31,'  '!$C$5:$D$370,2,FALSE)),IF(ISERROR(VLOOKUP(C31,' '!$A$1:$B$30,2,FALSE)),\"\",VLOOKUP(C31,' '!$A$1:$B$30,2,FALSE)),VLOOKUP(C31,'  '!$C$5:$D$370,2,FALSE))","v":""},"","1900-01-01","2018-12-23",{"$f":"IF(ISERROR(VLOOKUP(G31,'  '!$C$5:$D$370,2,FALSE)),IF(ISERROR(VLOOKUP(G31,' '!$A$1:$B$30,2,FALSE)),\"\",VLOOKUP(G31,' '!$A$1:$B$30,2,FALSE)),VLOOKUP(G31,'  '!$C$5:$D$370,2,FALSE))","v":""},"","1900-01-04","2019-01-23",{"$f":"IF(ISERROR(VLOOKUP(K32,'  '!$C$5:$D$370,2,FALSE)),IF(ISERROR(VLOOKUP(K32,' '!$A$1:$B$30,2,FALSE)),\"\",VLOOKUP(K32,' '!$A$1:$B$30,2,FALSE)),VLOOKUP(K32,'  '!$C$5:$D$370,2,FALSE))","v":""},"","1900-01-07","2019-02-23",{"$f":"IF(ISERROR(VLOOKUP(O31,'  '!$C$5:$D$370,2,FALSE)),IF(ISERROR(VLOOKUP(O31,' '!$A$1:$B$30,2,FALSE)),\"\",VLOOKUP(O31,' '!$A$1:$B$30,2,FALSE)),VLOOKUP(O31,'  '!$C$5:$D$370,2,FALSE))","v":""},"","1900-01-07","2019-03-23",{"$f":"IF(ISERROR(VLOOKUP(S31,'  '!$C$5:$D$370,2,FALSE)),IF(ISERROR(VLOOKUP(S31,' '!$A$1:$B$30,2,FALSE)),\"\",VLOOKUP(S31,' '!$A$1:$B$30,2,FALSE)),VLOOKUP(S31,'  '!$C$5:$D$370,2,FALSE))","v":""},"","1900-01-03","2019-04-23",{"$f":"IF(ISERROR(VLOOKUP(W31,'  '!$C$5:$D$370,2,FALSE)),IF(ISERROR(VLOOKUP(W31,' '!$A$1:$B$30,2,FALSE)),\"\",VLOOKUP(W31,' '!$A$1:$B$30,2,FALSE)),VLOOKUP(W31,'  '!$C$5:$D$370,2,FALSE))","v":""},""]
[null,"1900-01-07","2018-11-24",{"$f":"IF(ISERROR(VLOOKUP(C32,'  '!$C$5:$D$370,2,FALSE)),IF(ISERROR(VLOOKUP(C32,' '!$A$1:$B$30,2,FALSE)),\"\",VLOOKUP(C32,' '!$A$1:$B$30,2,FALSE)),VLOOKUP(C32,'  '!$C$5:$D$370,2,FALSE))","v":""},"","1900-01-02","2018-12-24",{"$f":"IF(ISERROR(VLOOKUP(G32,'  '!$C$5:$D$370,2,FALSE)),IF(ISERROR(VLOOKUP(G32,' '!$A$1:$B$30,2,FALSE)),\"\",VLOOKUP(G32,' '!$A$1:$B$30,2,FALSE)),VLOOKUP(G32,'  '!$C$5:$D$370,2,FALSE))","v":""},52,"1900-01-05","2019-01-24",null,"","1900-01-01","2019-02-24",{"$f":"IF(ISERROR(VLOOKUP(O32,'  '!$C$5:$D$370,2,FALSE)),IF(ISERROR(VLOOKUP(O32,' '!$A$1:$B$30,2,FALSE)),\"\",VLOOKUP(O32,' '!$A$1:$B$30,2,FALSE)),VLOOKUP(O32,'  '!$C$5:$D$370,2,FALSE))","v":""},"","1900-01-01","2019-03-24",{"$f":"IF(ISERROR(VLOOKUP(S32,'  '!$C$5:$D$370,2,FALSE)),IF(ISERROR(VLOOKUP(S32,' '!$A$1:$B$30,2,FALSE)),\"\",VLOOKUP(S32,' '!$A$1:$B$30,2,FALSE)),VLOOKUP(S32,'  '!$C$5:$D$370,2,FALSE))","v":""},"","1900-01-04","2019-04-24",{"$f":"IF(ISERROR(VLOOKUP(W32,'  '!$C$5:$D$370,2,FALSE)),IF(ISERROR(VLOOKUP(W32,' '!$A$1:$B$30,2,FALSE)),\"\",VLOOKUP(W32,' '!$A$1:$B$30,2,FALSE)),VLOOKUP(W32,'  '!$C$5:$D$370,2,FALSE))","v":""},""]
[null,"1900-01-01","2018-11-25",{"$f":"IF(ISERROR(VLOOKUP(C33,'  '!$C$5:$D$370,2,FALSE)),IF(ISERROR(VLOOKUP(C33,' '!$A$1:$B$30,2,FALSE)),\"\",VLOOKUP(C33,' '!$A$1:$B$30,2,FALSE)),VLOOKUP(C33,'  '!$C$5:$D$370,2,FALSE))","v":""},"","1900-01-03","2018-12-25",{"$f":"IF(ISERROR(VLOOKUP(G33,'  '!$C$5:$D$370,2,FALSE)),IF(ISERROR(VLOOKUP(G33,' '!$A$1:$B$30,2,FALSE)),\"\",VLOOKUP(G33,' '!$A$1:$B$30,2,FALSE)),VLOOKUP(G33,'  '!$C$5:$D$370,2,FALSE))","v":"1. juledag"},"","1900-01-06","2019-01-25",{"$f":"IF(ISERROR(VLOOKUP(K33,'  '!$C$5:$D$370,2,FALSE)),IF(ISERROR(VLOOKUP(K33,' '!$A$1:$B$30,2,FALSE)),\"\",VLOOKUP(K33,' '!$A$1:$B$30,2,FALSE)),VLOOKUP(K33,'  '!$C$5:$D$370,2,FALSE))","v":""},"","1900-01-02","2019-02-25",{"$f":"IF(ISERROR(VLOOKUP(O33,'  '!$C$5:$D$370,2,FALSE)),IF(ISERROR(VLOOKUP(O33,' '!$A$1:$B$30,2,FALSE)),\"\",VLOOKUP(O33,' '!$A$1:$B$30,2,FALSE)),VLOOKUP(O33,'  '!$C$5:$D$370,2,FALSE))","v":""},9,"1900-01-02","2019-03-25",{"$f":"IF(ISERROR(VLOOKUP(S33,'  '!$C$5:$D$370,2,FALSE)),IF(ISERROR(VLOOKUP(S33,' '!$A$1:$B$30,2,FALSE)),\"\",VLOOKUP(S33,' '!$A$1:$B$30,2,FALSE)),VLOOKUP(S33,'  '!$C$5:$D$370,2,FALSE))","v":""},13,"1900-01-05","2019-04-25",{"$f":"IF(ISERROR(VLOOKUP(W33,'  '!$C$5:$D$370,2,FALSE)),IF(ISERROR(VLOOKUP(W33,' '!$A$1:$B$30,2,FALSE)),\"\",VLOOKUP(W33,' '!$A$1:$B$30,2,FALSE)),VLOOKUP(W33,'  '!$C$5:$D$370,2,FALSE))","v":""},""]
[null,"1900-01-02","2018-11-26",{"$f":"IF(ISERROR(VLOOKUP(C34,'  '!$C$5:$D$370,2,FALSE)),IF(ISERROR(VLOOKUP(C34,' '!$A$1:$B$30,2,FALSE)),\"\",VLOOKUP(C34,' '!$A$1:$B$30,2,FALSE)),VLOOKUP(C34,'  '!$C$5:$D$370,2,FALSE))","v":""},48,"1900-01-04","2018-12-26",{"$f":"IF(ISERROR(VLOOKUP(G34,'  '!$C$5:$D$370,2,FALSE)),IF(ISERROR(VLOOKUP(G34,' '!$A$1:$B$30,2,FALSE)),\"\",VLOOKUP(G34,' '!$A$1:$B$30,2,FALSE)),VLOOKUP(G34,'  '!$C$5:$D$370,2,FALSE))","v":"2. juledag"},"","1900-01-07","2019-01-26",{"$f":"IF(ISERROR(VLOOKUP(K34,'  '!$C$5:$D$370,2,FALSE)),IF(ISERROR(VLOOKUP(K34,' '!$A$1:$B$30,2,FALSE)),\"\",VLOOKUP(K34,' '!$A$1:$B$30,2,FALSE)),VLOOKUP(K34,'  '!$C$5:$D$370,2,FALSE))","v":""},"","1900-01-03","2019-02-26","Gl. drenge","","1900-01-03","2019-03-26","Gl. drenge","","1900-01-06","2019-04-26",{"$f":"IF(ISERROR(VLOOKUP(W34,'  '!$C$5:$D$370,2,FALSE)),IF(ISERROR(VLOOKUP(W34,' '!$A$1:$B$30,2,FALSE)),\"\",VLOOKUP(W34,' '!$A$1:$B$30,2,FALSE)),VLOOKUP(W34,'  '!$C$5:$D$370,2,FALSE))","v":""},""]
[null,"1900-01-03","2018-11-27","Gl. drenge","","1900-01-05","2018-12-27",{"$f":"IF(ISERROR(VLOOKUP(G35,'  '!$C$5:$D$370,2,FALSE)),IF(ISERROR(VLOOKUP(G35,' '!$A$1:$B$30,2,FALSE)),\"\",VLOOKUP(G35,' '!$A$1:$B$30,2,FALSE)),VLOOKUP(G35,'  '!$C$5:$D$370,2,FALSE))","v":""},"","1900-01-01","2019-01-27",{"$f":"IF(ISERROR(VLOOKUP(K35,'  '!$C$5:$D$370,2,FALSE)),IF(ISERROR(VLOOKUP(K35,' '!$A$1:$B$30,2,FALSE)),\"\",VLOOKUP(K35,' '!$A$1:$B$30,2,FALSE)),VLOOKUP(K35,'  '!$C$5:$D$370,2,FALSE))","v":""},"","1900-01-04","2019-02-27",{"$f":"IF(ISERROR(VLOOKUP(O35,'  '!$C$5:$D$370,2,FALSE)),IF(ISERROR(VLOOKUP(O35,' '!$A$1:$B$30,2,FALSE)),\"\",VLOOKUP(O35,' '!$A$1:$B$30,2,FALSE)),VLOOKUP(O35,'  '!$C$5:$D$370,2,FALSE))","v":""},"","1900-01-04","2019-03-27",{"$f":"IF(ISERROR(VLOOKUP(S35,'  '!$C$5:$D$370,2,FALSE)),IF(ISERROR(VLOOKUP(S35,' '!$A$1:$B$30,2,FALSE)),\"\",VLOOKUP(S35,' '!$A$1:$B$30,2,FALSE)),VLOOKUP(S35,'  '!$C$5:$D$370,2,FALSE))","v":""},"","1900-01-07","2019-04-27",{"$f":"IF(ISERROR(VLOOKUP(W35,'  '!$C$5:$D$370,2,FALSE)),IF(ISERROR(VLOOKUP(W35,' '!$A$1:$B$30,2,FALSE)),\"\",VLOOKUP(W35,' '!$A$1:$B$30,2,FALSE)),VLOOKUP(W35,'  '!$C$5:$D$370,2,FALSE))","v":""},""]
[null,"1900-01-04","2018-11-28",{"$f":"IF(ISERROR(VLOOKUP(C36,'  '!$C$5:$D$370,2,FALSE)),IF(ISERROR(VLOOKUP(C36,' '!$A$1:$B$30,2,FALSE)),\"\",VLOOKUP(C36,' '!$A$1:$B$30,2,FALSE)),VLOOKUP(C36,'  '!$C$5:$D$370,2,FALSE))","v":""},"","1900-01-06","2018-12-28",{"$f":"IF(ISERROR(VLOOKUP(G36,'  '!$C$5:$D$370,2,FALSE)),IF(ISERROR(VLOOKUP(G36,' '!$A$1:$B$30,2,FALSE)),\"\",VLOOKUP(G36,' '!$A$1:$B$30,2,FALSE)),VLOOKUP(G36,'  '!$C$5:$D$370,2,FALSE))","v":""},"","1900-01-02","2019-01-28",{"$f":"IF(ISERROR(VLOOKUP(K36,'  '!$C$5:$D$370,2,FALSE)),IF(ISERROR(VLOOKUP(K36,' '!$A$1:$B$30,2,FALSE)),\"\",VLOOKUP(K36,' '!$A$1:$B$30,2,FALSE)),VLOOKUP(K36,'  '!$C$5:$D$370,2,FALSE))","v":""},5,"1900-01-05","2019-02-28",{"$f":"IF(ISERROR(VLOOKUP(O36,'  '!$C$5:$D$370,2,FALSE)),IF(ISERROR(VLOOKUP(O36,' '!$A$1:$B$30,2,FALSE)),\"\",VLOOKUP(O36,' '!$A$1:$B$30,2,FALSE)),VLOOKUP(O36,'  '!$C$5:$D$370,2,FALSE))","v":""},"","1900-01-05","2019-03-28",{"$f":"IF(ISERROR(VLOOKUP(S36,'  '!$C$5:$D$370,2,FALSE)),IF(ISERROR(VLOOKUP(S36,' '!$A$1:$B$30,2,FALSE)),\"\",VLOOKUP(S36,' '!$A$1:$B$30,2,FALSE)),VLOOKUP(S36,'  '!$C$5:$D$370,2,FALSE))","v":""},"","1900-01-01","2019-04-28",{"$f":"IF(ISERROR(VLOOKUP(W36,'  '!$C$5:$D$370,2,FALSE)),IF(ISERROR(VLOOKUP(W36,' '!$A$1:$B$30,2,FALSE)),\"\",VLOOKUP(W36,' '!$A$1:$B$30,2,FALSE)),VLOOKUP(W36,'  '!$C$5:$D$370,2,FALSE))","v":""},""]
[null,{"$f":"IF(C37=\"\",\"\",WEEKDAY(C37,1))","v":"1900-01-05"},{"$f":"IF(C36=\"\",\"\",IF(DAY(C36)>DAY(C36+1),\"\",C36+1))","v":"2018-11-29"},{"$f":"IF(ISERROR(VLOOKUP(C37,'  '!$C$5:$D$370,2,FALSE)),IF(ISERROR(VLOOKUP(C37,' '!$A$1:$B$30,2,FALSE)),\"\",VLOOKUP(C37,' '!$A$1:$B$30,2,FALSE)),VLOOKUP(C37,'  '!$C$5:$D$370,2,FALSE))","v":""},"",{"$f":"IF(G37=\"\",\"\",WEEKDAY(G37,1))","v":"1900-01-07"},{"$f":"IF(G36=\"\",\"\",IF(DAY(G36)>DAY(G36+1),\"\",G36+1))","v":"2018-12-29"},{"$f":"IF(ISERROR(VLOOKUP(G37,'  '!$C$5:$D$370,2,FALSE)),IF(ISERROR(VLOOKUP(G37,' '!$A$1:$B$30,2,FALSE)),\"\",VLOOKUP(G37,' '!$A$1:$B$30,2,FALSE)),VLOOKUP(G37,'  '!$C$5:$D$370,2,FALSE))","v":""},"",{"$f":"IF(K37=\"\",\"\",WEEKDAY(K37,1))","v":"1900-01-03"},{"$f":"IF(K36=\"\",\"\",IF(DAY(K36)>DAY(K36+1),\"\",K36+1))","v":"2019-01-29"},"Gl. drenge","",{"$f":"IF(O37=\"\",\"\",WEEKDAY(O37,1))","v":""},{"$f":"IF(O36=\"\",\"\",IF(DAY(O36)>DAY(O36+1),\"\",O36+1))","v":""},{"$f":"IF(ISERROR(VLOOKUP(O37,'  '!$C$5:$D$370,2,FALSE)),IF(ISERROR(VLOOKUP(O37,' '!$A$1:$B$30,2,FALSE)),\"\",VLOOKUP(O37,' '!$A$1:$B$30,2,FALSE)),VLOOKUP(O37,'  '!$C$5:$D$370,2,FALSE))","v":""},"",{"$f":"IF(S37=\"\",\"\",WEEKDAY(S37,1))","v":"1900-01-06"},{"$f":"IF(S36=\"\",\"\",IF(DAY(S36)>DAY(S36+1),\"\",S36+1))","v":"2019-03-29"},{"$f":"IF(ISERROR(VLOOKUP(S37,'  '!$C$5:$D$370,2,FALSE)),IF(ISERROR(VLOOKUP(S37,' '!$A$1:$B$30,2,FALSE)),\"\",VLOOKUP(S37,' '!$A$1:$B$30,2,FALSE)),VLOOKUP(S37,'  '!$C$5:$D$370,2,FALSE))","v":""},"",{"$f":"IF(W37=\"\",\"\",WEEKDAY(W37,1))","v":"1900-01-02"},{"$f":"IF(W36=\"\",\"\",IF(DAY(W36)>DAY(W36+1),\"\",W36+1))","v":"2019-04-29"},{"$f":"IF(ISERROR(VLOOKUP(W37,'  '!$C$5:$D$370,2,FALSE)),IF(ISERROR(VLOOKUP(W37,' '!$A$1:$B$30,2,FALSE)),\"\",VLOOKUP(W37,' '!$A$1:$B$30,2,FALSE)),VLOOKUP(W37,'  '!$C$5:$D$370,2,FALSE))","v":""},18]
[null,{"$f":"IF(C38=\"\",\"\",WEEKDAY(C38,1))","v":"1900-01-06"},{"$f":"IF(C37=\"\",\"\",IF(DAY(C37)>DAY(C37+1),\"\",C37+1))","v":"2018-11-30"},{"$f":"IF(ISERROR(VLOOKUP(C38,'  '!$C$5:$D$370,2,FALSE)),IF(ISERROR(VLOOKUP(C38,' '!$A$1:$B$30,2,FALSE)),\"\",VLOOKUP(C38,' '!$A$1:$B$30,2,FALSE)),VLOOKUP(C38,'  '!$C$5:$D$370,2,FALSE))","v":""},"",{"$f":"IF(G38=\"\",\"\",WEEKDAY(G38,1))","v":"1900-01-01"},{"$f":"IF(G37=\"\",\"\",IF(DAY(G37)>DAY(G37+1),\"\",G37+1))","v":"2018-12-30"},{"$f":"IF(ISERROR(VLOOKUP(G38,'  '!$C$5:$D$370,2,FALSE)),IF(ISERROR(VLOOKUP(G38,' '!$A$1:$B$30,2,FALSE)),\"\",VLOOKUP(G38,' '!$A$1:$B$30,2,FALSE)),VLOOKUP(G38,'  '!$C$5:$D$370,2,FALSE))","v":""},"",{"$f":"IF(K38=\"\",\"\",WEEKDAY(K38,1))","v":"1900-01-04"},{"$f":"IF(K37=\"\",\"\",IF(DAY(K37)>DAY(K37+1),\"\",K37+1))","v":"2019-01-30"},{"$f":"IF(ISERROR(VLOOKUP(K38,'  '!$C$5:$D$370,2,FALSE)),IF(ISERROR(VLOOKUP(K38,' '!$A$1:$B$30,2,FALSE)),\"\",VLOOKUP(K38,' '!$A$1:$B$30,2,FALSE)),VLOOKUP(K38,'  '!$C$5:$D$370,2,FALSE))","v":""},"",{"$f":"IF(O38=\"\",\"\",WEEKDAY(O38,1))","v":""},{"$f":"IF(O37=\"\",\"\",IF(DAY(O37)>DAY(O37+1),\"\",O37+1))","v":""},{"$f":"IF(ISERROR(VLOOKUP(O38,'  '!$C$5:$D$370,2,FALSE)),IF(ISERROR(VLOOKUP(O38,' '!$A$1:$B$30,2,FALSE)),\"\",VLOOKUP(O38,' '!$A$1:$B$30,2,FALSE)),VLOOKUP(O38,'  '!$C$5:$D$370,2,FALSE))","v":""},"",{"$f":"IF(S38=\"\",\"\",WEEKDAY(S38,1))","v":"1900-01-07"},{"$f":"IF(S37=\"\",\"\",IF(DAY(S37)>DAY(S37+1),\"\",S37+1))","v":"2019-03-30"},{"$f":"IF(ISERROR(VLOOKUP(S38,'  '!$C$5:$D$370,2,FALSE)),IF(ISERROR(VLOOKUP(S38,' '!$A$1:$B$30,2,FALSE)),\"\",VLOOKUP(S38,' '!$A$1:$B$30,2,FALSE)),VLOOKUP(S38,'  '!$C$5:$D$370,2,FALSE))","v":""},"",{"$f":"IF(W38=\"\",\"\",WEEKDAY(W38,1))","v":"1900-01-03"},{"$f":"IF(W37=\"\",\"\",IF(DAY(W37)>DAY(W37+1),\"\",W37+1))","v":"2019-04-30"},"Gl. drenge",""]
[null,"","",{"$f":"IF(ISERROR(VLOOKUP(C39,'  '!$C$5:$D$370,2,FALSE)),IF(ISERROR(VLOOKUP(C39,' '!$A$1:$B$30,2,FALSE)),\"\",VLOOKUP(C39,' '!$A$1:$B$30,2,FALSE)),VLOOKUP(C39,'  '!$C$5:$D$370,2,FALSE))","v":""},"","1900-01-02","2018-12-31",{"$f":"IF(ISERROR(VLOOKUP(G39,'  '!$C$5:$D$370,2,FALSE)),IF(ISERROR(VLOOKUP(G39,' '!$A$1:$B$30,2,FALSE)),\"\",VLOOKUP(G39,' '!$A$1:$B$30,2,FALSE)),VLOOKUP(G39,'  '!$C$5:$D$370,2,FALSE))","v":"Nytårsaftens dag"},1,"1900-01-05","2019-01-31",{"$f":"IF(ISERROR(VLOOKUP(K39,'  '!$C$5:$D$370,2,FALSE)),IF(ISERROR(VLOOKUP(K39,' '!$A$1:$B$30,2,FALSE)),\"\",VLOOKUP(K39,' '!$A$1:$B$30,2,FALSE)),VLOOKUP(K39,'  '!$C$5:$D$370,2,FALSE))","v":""},"","","",{"$f":"IF(ISERROR(VLOOKUP(O39,'  '!$C$5:$D$370,2,FALSE)),IF(ISERROR(VLOOKUP(O39,' '!$A$1:$B$30,2,FALSE)),\"\",VLOOKUP(O39,' '!$A$1:$B$30,2,FALSE)),VLOOKUP(O39,'  '!$C$5:$D$370,2,FALSE))","v":""},"","1900-01-01","2019-03-31",{"$f":"IF(ISERROR(VLOOKUP(S39,'  '!$C$5:$D$370,2,FALSE)),IF(ISERROR(VLOOKUP(S39,' '!$A$1:$B$30,2,FALSE)),\"\",VLOOKUP(S39,' '!$A$1:$B$30,2,FALSE)),VLOOKUP(S39,'  '!$C$5:$D$370,2,FALSE))","v":""},"","","",{"$f":"IF(ISERROR(VLOOKUP(W39,'  '!$C$5:$D$370,2,FALSE)),IF(ISERROR(VLOOKUP(W39,' '!$A$1:$B$30,2,FALSE)),\"\",VLOOKUP(W39,' '!$A$1:$B$30,2,FALSE)),VLOOKUP(W39,'  '!$C$5:$D$370,2,FALSE))","v":""},""]
[{"$nulls":4},{"$f":"NETWORKDAYS(MIN(C9:C39),MAX(C9:C39),' '!$A$2:$A$30)& \" arbejdsdage ekskl. \"&COUNTIF(B9:B39,7)& \" lørdage\"","v":"22 arbejdsdage ekskl. 4 lørdage"},null,null,null,{"$f":"NETWORKDAYS(MIN(G9:G39),MAX(G9:G39),' '!$A$2:$A$30)& \" arbejdsdage ekskl. \"&COUNTIF(F9:F39,7)& \" lørdage\"","v":"18 arbejdsdage ekskl. 5 lørdage"},null,null,null,{"$f":"NETWORKDAYS(MIN(K9:K39),MAX(K9:K39),' '!$A$2:$A$30)& \" arbejdsdage ekskl. \"&COUNTIF(J9:J39,7)& \" lørdage\"","v":"22 arbejdsdage ekskl. 4 lørdage"},null,null,null,{"$f":"NETWORKDAYS(MIN(O9:O39),MAX(O9:O39),' '!$A$2:$A$30)& \" arbejdsdage ekskl. \"&COUNTIF(N9:N39,7)& \" lørdage\"","v":"20 arbejdsdage ekskl. 4 lørdage"},null,null,null,{"$f":"NETWORKDAYS(MIN(S9:S39),MAX(S9:S39),' '!$A$2:$A$30)& \" arbejdsdage ekskl. \"&COUNTIF(R9:R39,7)& \" lørdage\"","v":"21 arbejdsdage ekskl. 5 lørdage"},null,null,null,{"$f":"NETWORKDAYS(MIN(W9:W39),MAX(W9:W39),' '!$A$2:$A$30)& \" arbejdsdage ekskl. \"&COUNTIF(V9:V39,7)& \" lørdage\"","v":"19 arbejdsdage ekskl. 4 lørdage"}]
[null,null,null,{"$f":"IF(X4=12,X3+1,X3)","v":2019},null,null,null,{"$f":"IF(D42=12,D41+1,D41)","v":2019},null,null,null,{"$f":"IF(H42=12,H41+1,H41)","v":2019},null,null,null,{"$f":"IF(L42=12,L41+1,L41)","v":2019},null,null,null,{"$f":"IF(P42=12,P41+1,P41)","v":2019},null,null,null,{"$f":"IF(T42=12,T41+1,T41)","v":2019}]
[null,null,null,{"$f":"IF(X4=12,1,X4+1)","v":5},null,null,null,{"$f":"IF(D42=12,1,D42+1)","v":6},null,null,null,{"$f":"IF(H42=12,1,H42+1)","v":7},null,null,null,{"$f":"IF(L42=12,1,L42+1)","v":8},null,null,null,{"$f":"IF(P42=12,1,P42+1)","v":9},null,null,null,{"$f":"IF(T42=12,1,T42+1)","v":10}]
[{"$nulls":17},{"$f":"IF(YEAR(C47)=YEAR(W47),YEAR(C47),YEAR(C47)&\" / \"&YEAR(W47))","v":2019}]
[]
[]
[null,{"$f":"PROPER(TEXT(DATE($D$2,D42,1),\"mmmm\"))","v":"Maj"},null,null,null,{"$f":"PROPER(TEXT(DATE($D$2,H42,1),\"mmmm\"))","v":"Juni"},null,null,null,{"$f":"PROPER(TEXT(DATE($D$2,L42,1),\"mmmm\"))","v":"Juli"},null,null,null,{"$f":"PROPER(TEXT(DATE($D$2,P42,1),\"mmmm\"))","v":"August"},null,null,null,{"$f":"PROPER(TEXT(DATE($D$2,T42,1),\"mmmm\"))","v":"September"},null,null,null,{"$f":"PROPER(TEXT(DATE($D$2,X42,1),\"mmmm\"))","v":"Oktober"}]
[null,{"$f":"WEEKDAY(C47,1)","v":"1900-01-04"},{"$f":"DATE(D$41,D$42,1)","v":"2019-05-01"},{"$f":"IF(ISERROR(VLOOKUP(C47,'  '!$C$5:$D$370,2,FALSE)),IF(ISERROR(VLOOKUP(C47,' '!$A$1:$B$30,2,FALSE)),\"\",VLOOKUP(C47,' '!$A$1:$B$30,2,FALSE)),VLOOKUP(C47,'  '!$C$5:$D$370,2,FALSE))","v":""},{"$f":"IF(B47=2,1+INT((C47-DATE(YEAR(C47+4-WEEKDAY(C47+6)),1,5)+WEEKDAY(DATE(YEAR(C47+4-WEEKDAY(C47+6)),1,3)))/7),\"\")","v":""},{"$f":"WEEKDAY(G47,1)","v":"1900-01-07"},{"$f":"DATE(H$41,H$42,1)","v":"2019-06-01"},"Nørhalne cup",{"$f":"IF(F47=2,1+INT((G47-DATE(YEAR(G47+4-WEEKDAY(G47+6)),1,5)+WEEKDAY(DATE(YEAR(G47+4-WEEKDAY(G47+6)),1,3)))/7),\"\")","v":""},{"$f":"WEEKDAY(K47,1)","v":"1900-01-02"},{"$f":"DATE(L$41,L$42,1)","v":"2019-07-01"},"DBU fodboldskole",{"$f":"IF(J47=2,1+INT((K47-DATE(YEAR(K47+4-WEEKDAY(K47+6)),1,5)+WEEKDAY(DATE(YEAR(K47+4-WEEKDAY(K47+6)),1,3)))/7),\"\")","v":27},{"$f":"WEEKDAY(O47,1)","v":"1900-01-05"},{"$f":"DATE(P$41,P$42,1)","v":"2019-08-01"},null,{"$f":"IF(N47=2,1+INT((O47-DATE(YEAR(O47+4-WEEKDAY(O47+6)),1,5)+WEEKDAY(DATE(YEAR(O47+4-WEEKDAY(O47+6)),1,3)))/7),\"\")","v":""},{"$f":"WEEKDAY(S47,1)","v":"1900-01-01"},{"$f":"DATE(T$41,T$42,1)","v":"2019-09-01"},{"$f":"IF(ISERROR(VLOOKUP(S47,'  '!$C$5:$D$370,2,FALSE)),IF(ISERROR(VLOOKUP(S47,' '!$A$1:$B$30,2,FALSE)),\"\",VLOOKUP(S47,' '!$A$1:$B$30,2,FALSE)),VLOOKUP(S47,'  '!$C$5:$D$370,2,FALSE))","v":""},{"$f":"IF(R47=2,1+INT((S47-DATE(YEAR(S47+4-WEEKDAY(S47+6)),1,5)+WEEKDAY(DATE(YEAR(S47+4-WEEKDAY(S47+6)),1,3)))/7),\"\")","v":""},{"$f":"WEEKDAY(W47,1)","v":"1900-01-03"},{"$f":"DATE(X$41,X$42,1)","v":"2019-10-01"},{"$f":"IF(ISERROR(VLOOKUP(W47,'  '!$C$5:$D$370,2,FALSE)),IF(ISERROR(VLOOKUP(W47,' '!$A$1:$B$30,2,FALSE)),\"\",VLOOKUP(W47,' '!$A$1:$B$30,2,FALSE)),VLOOKUP(W47,'  '!$C$5:$D$370,2,FALSE))","v":""},{"$f":"IF(V47=2,1+INT((W47-DATE(YEAR(W47+4-WEEKDAY(W47+6)),1,5)+WEEKDAY(DATE(YEAR(W47+4-WEEKDAY(W47+6)),1,3)))/7),\"\")","v":""}]
[null,{"$f":"WEEKDAY(C48,1)","v":"1900-01-05"},{"$f":"C47+1","v":"2019-05-02"},null,{"$f":"IF(B48=2,1+INT((C48-DATE(YEAR(C48+4-WEEKDAY(C48+6)),1,5)+WEEKDAY(DATE(YEAR(C48+4-WEEKDAY(C48+6)),1,3)))/7),\"\")","v":""},{"$f":"WEEKDAY(G48,1)","v":"1900-01-01"},{"$f":"G47+1","v":"2019-06-02"},null,{"$f":"IF(F48=2,1+INT((G48-DATE(YEAR(G48+4-WEEKDAY(G48+6)),1,5)+WEEKDAY(DATE(YEAR(G48+4-WEEKDAY(G48+6)),1,3)))/7),\"\")","v":""},{"$f":"WEEKDAY(K48,1)","v":"1900-01-03"},{"$f":"K47+1","v":"2019-07-02"},"DBU fodboldskole",{"$f":"IF(J48=2,1+INT((K48-DATE(YEAR(K48+4-WEEKDAY(K48+6)),1,5)+WEEKDAY(DATE(YEAR(K48+4-WEEKDAY(K48+6)),1,3)))/7),\"\")","v":""},{"$f":"WEEKDAY(O48,1)","v":"1900-01-06"},{"$f":"O47+1","v":"2019-08-02"},{"$f":"IF(ISERROR(VLOOKUP(O48,'  '!$C$5:$D$370,2,FALSE)),IF(ISERROR(VLOOKUP(O48,' '!$A$1:$B$30,2,FALSE)),\"\",VLOOKUP(O48,' '!$A$1:$B$30,2,FALSE)),VLOOKUP(O48,'  '!$C$5:$D$370,2,FALSE))","v":""},{"$f":"IF(N48=2,1+INT((O48-DATE(YEAR(O48+4-WEEKDAY(O48+6)),1,5)+WEEKDAY(DATE(YEAR(O48+4-WEEKDAY(O48+6)),1,3)))/7),\"\")","v":""},{"$f":"WEEKDAY(S48,1)","v":"1900-01-02"},{"$f":"S47+1","v":"2019-09-02"},{"$f":"IF(ISERROR(VLOOKUP(S48,'  '!$C$5:$D$370,2,FALSE)),IF(ISERROR(VLOOKUP(S48,' '!$A$1:$B$30,2,FALSE)),\"\",VLOOKUP(S48,' '!$A$1:$B$30,2,FALSE)),VLOOKUP(S48,'  '!$C$5:$D$370,2,FALSE))","v":""},{"$f":"IF(R48=2,1+INT((S48-DATE(YEAR(S48+4-WEEKDAY(S48+6)),1,5)+WEEKDAY(DATE(YEAR(S48+4-WEEKDAY(S48+6)),1,3)))/7),\"\")","v":36},{"$f":"WEEKDAY(W48,1)","v":"1900-01-04"},{"$f":"W47+1","v":"2019-10-02"},{"$f":"IF(ISERROR(VLOOKUP(W48,'  '!$C$5:$D$370,2,FALSE)),IF(ISERROR(VLOOKUP(W48,' '!$A$1:$B$30,2,FALSE)),\"\",VLOOKUP(W48,' '!$A$1:$B$30,2,FALSE)),VLOOKUP(W48,'  '!$C$5:$D$370,2,FALSE))","v":""},{"$f":"IF(V48=2,1+INT((W48-DATE(YEAR(W48+4-WEEKDAY(W48+6)),1,5)+WEEKDAY(DATE(YEAR(W48+4-WEEKDAY(W48+6)),1,3)))/7),\"\")","v":""}]
[null,"1900-01-06",{"$f":"C48+1","v":"2019-05-03"},null,"","1900-01-02",{"$f":"G48+1","v":"2019-06-03"},null,23,"1900-01-04",{"$f":"K48+1","v":"2019-07-03"},"DBU fodboldskole","","1900-01-07",{"$f":"O48+1","v":"2019-08-03"},{"$f":"IF(ISERROR(VLOOKUP(O49,'  '!$C$5:$D$370,2,FALSE)),IF(ISERROR(VLOOKUP(O49,' '!$A$1:$B$30,2,FALSE)),\"\",VLOOKUP(O49,' '!$A$1:$B$30,2,FALSE)),VLOOKUP(O49,'  '!$C$5:$D$370,2,FALSE))","v":""},"","1900-01-03",{"$f":"S48+1","v":"2019-09-03"},null,"","1900-01-05",{"$f":"W48+1","v":"2019-10-03"},{"$f":"IF(ISERROR(VLOOKUP(W49,'  '!$C$5:$D$370,2,FALSE)),IF(ISERROR(VLOOKUP(W49,' '!$A$1:$B$30,2,FALSE)),\"\",VLOOKUP(W49,' '!$A$1:$B$30,2,FALSE)),VLOOKUP(W49,'  '!$C$5:$D$370,2,FALSE))","v":""},""]
[null,"1900-01-07","2019-05-04",null,"","1900-01-03","2019-06-04",{"$f":"IF(ISERROR(VLOOKUP(G50,'  '!$C$5:$D$370,2,FALSE)),IF(ISERROR(VLOOKUP(G50,' '!$A$1:$B$30,2,FALSE)),\"\",VLOOKUP(G50,' '!$A$1:$B$30,2,FALSE)),VLOOKUP(G50,'  '!$C$5:$D$370,2,FALSE))","v":""},"","1900-01-05","2019-07-04","DBU fodboldskole","","1900-01-01","2019-08-04",{"$f":"IF(ISERROR(VLOOKUP(O50,'  '!$C$5:$D$370,2,FALSE)),IF(ISERROR(VLOOKUP(O50,' '!$A$1:$B$30,2,FALSE)),\"\",VLOOKUP(O50,' '!$A$1:$B$30,2,FALSE)),VLOOKUP(O50,'  '!$C$5:$D$370,2,FALSE))","v":""},"","1900-01-04","2019-09-04",{"$f":"IF(ISERROR(VLOOKUP(S50,'  '!$C$5:$D$370,2,FALSE)),IF(ISERROR(VLOOKUP(S50,' '!$A$1:$B$30,2,FALSE)),\"\",VLOOKUP(S50,' '!$A$1:$B$30,2,FALSE)),VLOOKUP(S50,'  '!$C$5:$D$370,2,FALSE))","v":""},"","1900-01-06","2019-10-04",{"$f":"IF(ISERROR(VLOOKUP(W50,'  '!$C$5:$D$370,2,FALSE)),IF(ISERROR(VLOOKUP(W50,' '!$A$1:$B$30,2,FALSE)),\"\",VLOOKUP(W50,' '!$A$1:$B$30,2,FALSE)),VLOOKUP(W50,'  '!$C$5:$D$370,2,FALSE))","v":""},""]
[null,"1900-01-01","2019-05-05",null,"","1900-01-04","2019-06-05",{"$f":"IF(ISERROR(VLOOKUP(G51,'  '!$C$5:$D$370,2,FALSE)),IF(ISERROR(VLOOKUP(G51,' '!$A$1:$B$30,2,FALSE)),\"\",VLOOKUP(G51,' '!$A$1:$B$30,2,FALSE)),VLOOKUP(G51,'  '!$C$5:$D$370,2,FALSE))","v":"Grundlovsdag"},"","1900-01-06","2019-07-05","DBU fodboldskole","","1900-01-02","2019-08-05",{"$f":"IF(ISERROR(VLOOKUP(O51,'  '!$C$5:$D$370,2,FALSE)),IF(ISERROR(VLOOKUP(O51,' '!$A$1:$B$30,2,FALSE)),\"\",VLOOKUP(O51,' '!$A$1:$B$30,2,FALSE)),VLOOKUP(O51,'  '!$C$5:$D$370,2,FALSE))","v":""},32,"1900-01-05","2019-09-05",{"$f":"IF(ISERROR(VLOOKUP(S51,'  '!$C$5:$D$370,2,FALSE)),IF(ISERROR(VLOOKUP(S51,' '!$A$1:$B$30,2,FALSE)),\"\",VLOOKUP(S51,' '!$A$1:$B$30,2,FALSE)),VLOOKUP(S51,'  '!$C$5:$D$370,2,FALSE))","v":""},"","1900-01-07","2019-10-05",{"$f":"IF(ISERROR(VLOOKUP(W51,'  '!$C$5:$D$370,2,FALSE)),IF(ISERROR(VLOOKUP(W51,' '!$A$1:$B$30,2,FALSE)),\"\",VLOOKUP(W51,' '!$A$1:$B$30,2,FALSE)),VLOOKUP(W51,'  '!$C$5:$D$370,2,FALSE))","v":""},""]
[null,"1900-01-02","2019-05-06",null,19,"1900-01-05","2019-06-06",{"$f":"IF(ISERROR(VLOOKUP(G52,'  '!$C$5:$D$370,2,FALSE)),IF(ISERROR(VLOOKUP(G52,' '!$A$1:$B$30,2,FALSE)),\"\",VLOOKUP(G52,' '!$A$1:$B$30,2,FALSE)),VLOOKUP(G52,'  '!$C$5:$D$370,2,FALSE))","v":""},"","1900-01-07","2019-07-06",{"$f":"IF(ISERROR(VLOOKUP(K52,'  '!$C$5:$D$370,2,FALSE)),IF(ISERROR(VLOOKUP(K52,' '!$A$1:$B$30,2,FALSE)),\"\",VLOOKUP(K52,' '!$A$1:$B$30,2,FALSE)),VLOOKUP(K52,'  '!$C$5:$D$370,2,FALSE))","v":""},"","1900-01-03","2019-08-06",{"$f":"IF(ISERROR(VLOOKUP(O52,'  '!$C$5:$D$370,2,FALSE)),IF(ISERROR(VLOOKUP(O52,' '!$A$1:$B$30,2,FALSE)),\"\",VLOOKUP(O52,' '!$A$1:$B$30,2,FALSE)),VLOOKUP(O52,'  '!$C$5:$D$370,2,FALSE))","v":""},"","1900-01-06","2019-09-06",{"$f":"IF(ISERROR(VLOOKUP(S52,'  '!$C$5:$D$370,2,FALSE)),IF(ISERROR(VLOOKUP(S52,' '!$A$1:$B$30,2,FALSE)),\"\",VLOOKUP(S52,' '!$A$1:$B$30,2,FALSE)),VLOOKUP(S52,'  '!$C$5:$D$370,2,FALSE))","v":""},"","1900-01-01","2019-10-06",{"$f":"IF(ISERROR(VLOOKUP(W52,'  '!$C$5:$D$370,2,FALSE)),IF(ISERROR(VLOOKUP(W52,' '!$A$1:$B$30,2,FALSE)),\"\",VLOOKUP(W52,' '!$A$1:$B$30,2,FALSE)),VLOOKUP(W52,'  '!$C$5:$D$370,2,FALSE))","v":""},""]
[null,"1900-01-03","2019-05-07",{"$f":"IF(ISERROR(VLOOKUP(C53,'  '!$C$5:$D$370,2,FALSE)),IF(ISERROR(VLOOKUP(C53,' '!$A$1:$B$30,2,FALSE)),\"\",VLOOKUP(C53,' '!$A$1:$B$30,2,FALSE)),VLOOKUP(C53,'  '!$C$5:$D$370,2,FALSE))","v":""},"","1900-01-06","2019-06-07",{"$f":"IF(ISERROR(VLOOKUP(G53,'  '!$C$5:$D$370,2,FALSE)),IF(ISERROR(VLOOKUP(G53,' '!$A$1:$B$30,2,FALSE)),\"\",VLOOKUP(G53,' '!$A$1:$B$30,2,FALSE)),VLOOKUP(G53,'  '!$C$5:$D$370,2,FALSE))","v":""},"","1900-01-01","2019-07-07",{"$f":"IF(ISERROR(VLOOKUP(K53,'  '!$C$5:$D$370,2,FALSE)),IF(ISERROR(VLOOKUP(K53,' '!$A$1:$B$30,2,FALSE)),\"\",VLOOKUP(K53,' '!$A$1:$B$30,2,FALSE)),VLOOKUP(K53,'  '!$C$5:$D$370,2,FALSE))","v":""},"","1900-01-04","2019-08-07",{"$f":"IF(ISERROR(VLOOKUP(O53,'  '!$C$5:$D$370,2,FALSE)),IF(ISERROR(VLOOKUP(O53,' '!$A$1:$B$30,2,FALSE)),\"\",VLOOKUP(O53,' '!$A$1:$B$30,2,FALSE)),VLOOKUP(O53,'  '!$C$5:$D$370,2,FALSE))","v":""},"","1900-01-07","2019-09-07",{"$f":"IF(ISERROR(VLOOKUP(S53,'  '!$C$5:$D$370,2,FALSE)),IF(ISERROR(VLOOKUP(S53,' '!$A$1:$B$30,2,FALSE)),\"\",VLOOKUP(S53,' '!$A$1:$B$30,2,FALSE)),VLOOKUP(S53,'  '!$C$5:$D$370,2,FALSE))","v":""},"","1900-01-02","2019-10-07",{"$f":"IF(ISERROR(VLOOKUP(W53,'  '!$C$5:$D$370,2,FALSE)),IF(ISERROR(VLOOKUP(W53,' '!$A$1:$B$30,2,FALSE)),\"\",VLOOKUP(W53,' '!$A$1:$B$30,2,FALSE)),VLOOKUP(W53,'  '!$C$5:$D$370,2,FALSE))","v":""},41]
[null,"1900-01-04","2019-05-08",{"$f":"IF(ISERROR(VLOOKUP(C54,'  '!$C$5:$D$370,2,FALSE)),IF(ISERROR(VLOOKUP(C54,' '!$A$1:$B$30,2,FALSE)),\"\",VLOOKUP(C54,' '!$A$1:$B$30,2,FALSE)),VLOOKUP(C54,'  '!$C$5:$D$370,2,FALSE))","v":""},"","1900-01-07","2019-06-08",{"$f":"IF(ISERROR(VLOOKUP(G54,'  '!$C$5:$D$370,2,FALSE)),IF(ISERROR(VLOOKUP(G54,' '!$A$1:$B$30,2,FALSE)),\"\",VLOOKUP(G54,' '!$A$1:$B$30,2,FALSE)),VLOOKUP(G54,'  '!$C$5:$D$370,2,FALSE))","v":""},"","1900-01-02","2019-07-08","Get2Sport fod",28,"1900-01-05","2019-08-08",{"$f":"IF(ISERROR(VLOOKUP(O54,'  '!$C$5:$D$370,2,FALSE)),IF(ISERROR(VLOOKUP(O54,' '!$A$1:$B$30,2,FALSE)),\"\",VLOOKUP(O54,' '!$A$1:$B$30,2,FALSE)),VLOOKUP(O54,'  '!$C$5:$D$370,2,FALSE))","v":""},"","1900-01-01","2019-09-08",{"$f":"IF(ISERROR(VLOOKUP(S54,'  '!$C$5:$D$370,2,FALSE)),IF(ISERROR(VLOOKUP(S54,' '!$A$1:$B$30,2,FALSE)),\"\",VLOOKUP(S54,' '!$A$1:$B$30,2,FALSE)),VLOOKUP(S54,'  '!$C$5:$D$370,2,FALSE))","v":""},"","1900-01-03","2019-10-08",{"$f":"IF(ISERROR(VLOOKUP(W54,'  '!$C$5:$D$370,2,FALSE)),IF(ISERROR(VLOOKUP(W54,' '!$A$1:$B$30,2,FALSE)),\"\",VLOOKUP(W54,' '!$A$1:$B$30,2,FALSE)),VLOOKUP(W54,'  '!$C$5:$D$370,2,FALSE))","v":""},""]
[null,"1900-01-05","2019-05-09",{"$f":"IF(ISERROR(VLOOKUP(C55,'  '!$C$5:$D$370,2,FALSE)),IF(ISERROR(VLOOKUP(C55,' '!$A$1:$B$30,2,FALSE)),\"\",VLOOKUP(C55,' '!$A$1:$B$30,2,FALSE)),VLOOKUP(C55,'  '!$C$5:$D$370,2,FALSE))","v":""},"","1900-01-01","2019-06-09",{"$f":"IF(ISERROR(VLOOKUP(G55,'  '!$C$5:$D$370,2,FALSE)),IF(ISERROR(VLOOKUP(G55,' '!$A$1:$B$30,2,FALSE)),\"\",VLOOKUP(G55,' '!$A$1:$B$30,2,FALSE)),VLOOKUP(G55,'  '!$C$5:$D$370,2,FALSE))","v":"Pinsedag"},"","1900-01-03","2019-07-09","Get2Sport fod","","1900-01-06","2019-08-09",{"$f":"IF(ISERROR(VLOOKUP(O55,'  '!$C$5:$D$370,2,FALSE)),IF(ISERROR(VLOOKUP(O55,' '!$A$1:$B$30,2,FALSE)),\"\",VLOOKUP(O55,' '!$A$1:$B$30,2,FALSE)),VLOOKUP(O55,'  '!$C$5:$D$370,2,FALSE))","v":""},"","1900-01-02","2019-09-09",{"$f":"IF(ISERROR(VLOOKUP(S55,'  '!$C$5:$D$370,2,FALSE)),IF(ISERROR(VLOOKUP(S55,' '!$A$1:$B$30,2,FALSE)),\"\",VLOOKUP(S55,' '!$A$1:$B$30,2,FALSE)),VLOOKUP(S55,'  '!$C$5:$D$370,2,FALSE))","v":""},37,"1900-01-04","2019-10-09",{"$f":"IF(ISERROR(VLOOKUP(W55,'  '!$C$5:$D$370,2,FALSE)),IF(ISERROR(VLOOKUP(W55,' '!$A$1:$B$30,2,FALSE)),\"\",VLOOKUP(W55,' '!$A$1:$B$30,2,FALSE)),VLOOKUP(W55,'  '!$C$5:$D$370,2,FALSE))","v":""},""]
[null,"1900-01-06","2019-05-10",{"$f":"IF(ISERROR(VLOOKUP(C56,'  '!$C$5:$D$370,2,FALSE)),IF(ISERROR(VLOOKUP(C56,' '!$A$1:$B$30,2,FALSE)),\"\",VLOOKUP(C56,' '!$A$1:$B$30,2,FALSE)),VLOOKUP(C56,'  '!$C$5:$D$370,2,FALSE))","v":""},"","1900-01-02","2019-06-10",{"$f":"IF(ISERROR(VLOOKUP(G56,'  '!$C$5:$D$370,2,FALSE)),IF(ISERROR(VLOOKUP(G56,' '!$A$1:$B$30,2,FALSE)),\"\",VLOOKUP(G56,' '!$A$1:$B$30,2,FALSE)),VLOOKUP(G56,'  '!$C$5:$D$370,2,FALSE))","v":"2. pinsedag"},24,"1900-01-04","2019-07-10","Get2Sport fod","","1900-01-07","2019-08-10",{"$f":"IF(ISERROR(VLOOKUP(O56,'  '!$C$5:$D$370,2,FALSE)),IF(ISERROR(VLOOKUP(O56,' '!$A$1:$B$30,2,FALSE)),\"\",VLOOKUP(O56,' '!$A$1:$B$30,2,FALSE)),VLOOKUP(O56,'  '!$C$5:$D$370,2,FALSE))","v":""},"","1900-01-03","2019-09-10",{"$f":"IF(ISERROR(VLOOKUP(S56,'  '!$C$5:$D$370,2,FALSE)),IF(ISERROR(VLOOKUP(S56,' '!$A$1:$B$30,2,FALSE)),\"\",VLOOKUP(S56,' '!$A$1:$B$30,2,FALSE)),VLOOKUP(S56,'  '!$C$5:$D$370,2,FALSE))","v":""},"","1900-01-05","2019-10-10",{"$f":"IF(ISERROR(VLOOKUP(W56,'  '!$C$5:$D$370,2,FALSE)),IF(ISERROR(VLOOKUP(W56,' '!$A$1:$B$30,2,FALSE)),\"\",VLOOKUP(W56,' '!$A$1:$B$30,2,FALSE)),VLOOKUP(W56,'  '!$C$5:$D$370,2,FALSE))","v":""},""]
[null,"1900-01-07","2019-05-11",{"$f":"IF(ISERROR(VLOOKUP(C57,'  '!$C$5:$D$370,2,FALSE)),IF(ISERROR(VLOOKUP(C57,' '!$A$1:$B$30,2,FALSE)),\"\",VLOOKUP(C57,' '!$A$1:$B$30,2,FALSE)),VLOOKUP(C57,'  '!$C$5:$D$370,2,FALSE))","v":""},"","1900-01-03","2019-06-11",{"$f":"IF(ISERROR(VLOOKUP(G57,'  '!$C$5:$D$370,2,FALSE)),IF(ISERROR(VLOOKUP(G57,' '!$A$1:$B$30,2,FALSE)),\"\",VLOOKUP(G57,' '!$A$1:$B$30,2,FALSE)),VLOOKUP(G57,'  '!$C$5:$D$370,2,FALSE))","v":""},"","1900-01-05","2019-07-11","Get2Sport fod","","1900-01-01","2019-08-11",{"$f":"IF(ISERROR(VLOOKUP(O57,'  '!$C$5:$D$370,2,FALSE)),IF(ISERROR(VLOOKUP(O57,' '!$A$1:$B$30,2,FALSE)),\"\",VLOOKUP(O57,' '!$A$1:$B$30,2,FALSE)),VLOOKUP(O57,'  '!$C$5:$D$370,2,FALSE))","v":""},"","1900-01-04","2019-09-11",{"$f":"IF(ISERROR(VLOOKUP(S57,'  '!$C$5:$D$370,2,FALSE)),IF(ISERROR(VLOOKUP(S57,' '!$A$1:$B$30,2,FALSE)),\"\",VLOOKUP(S57,' '!$A$1:$B$30,2,FALSE)),VLOOKUP(S57,'  '!$C$5:$D$370,2,FALSE))","v":""},"","1900-01-06","2019-10-11",{"$f":"IF(ISERROR(VLOOKUP(W57,'  '!$C$5:$D$370,2,FALSE)),IF(ISERROR(VLOOKUP(W57,' '!$A$1:$B$30,2,FALSE)),\"\",VLOOKUP(W57,' '!$A$1:$B$30,2,FALSE)),VLOOKUP(W57,'  '!$C$5:$D$370,2,FALSE))","v":""},""]
[null,"1900-01-01","2019-05-12",{"$f":"IF(ISERROR(VLOOKUP(C58,'  '!$C$5:$D$370,2,FALSE)),IF(ISERROR(VLOOKUP(C58,' '!$A$1:$B$30,2,FALSE)),\"\",VLOOKUP(C58,' '!$A$1:$B$30,2,FALSE)),VLOOKUP(C58,'  '!$C$5:$D$370,2,FALSE))","v":""},"","1900-01-04","2019-06-12",{"$f":"IF(ISERROR(VLOOKUP(G58,'  '!$C$5:$D$370,2,FALSE)),IF(ISERROR(VLOOKUP(G58,' '!$A$1:$B$30,2,FALSE)),\"\",VLOOKUP(G58,' '!$A$1:$B$30,2,FALSE)),VLOOKUP(G58,'  '!$C$5:$D$370,2,FALSE))","v":""},"","1900-01-06","2019-07-12","Get2Sport fod","","1900-01-02","2019-08-12",{"$f":"IF(ISERROR(VLOOKUP(O58,'  '!$C$5:$D$370,2,FALSE)),IF(ISERROR(VLOOKUP(O58,' '!$A$1:$B$30,2,FALSE)),\"\",VLOOKUP(O58,' '!$A$1:$B$30,2,FALSE)),VLOOKUP(O58,'  '!$C$5:$D$370,2,FALSE))","v":""},33,"1900-01-05","2019-09-12",{"$f":"IF(ISERROR(VLOOKUP(S58,'  '!$C$5:$D$370,2,FALSE)),IF(ISERROR(VLOOKUP(S58,' '!$A$1:$B$30,2,FALSE)),\"\",VLOOKUP(S58,' '!$A$1:$B$30,2,FALSE)),VLOOKUP(S58,'  '!$C$5:$D$370,2,FALSE))","v":""},"","1900-01-07","2019-10-12",{"$f":"IF(ISERROR(VLOOKUP(W58,'  '!$C$5:$D$370,2,FALSE)),IF(ISERROR(VLOOKUP(W58,' '!$A$1:$B$30,2,FALSE)),\"\",VLOOKUP(W58,' '!$A$1:$B$30,2,FALSE)),VLOOKUP(W58,'  '!$C$5:$D$370,2,FALSE))","v":""},""]
[null,"1900-01-02","2019-05-13","AaB fødselsdag",20,"1900-01-05","2019-06-13",{"$f":"IF(ISERROR(VLOOKUP(G59,'  '!$C$5:$D$370,2,FALSE)),IF(ISERROR(VLOOKUP(G59,' '!$A$1:$B$30,2,FALSE)),\"\",VLOOKUP(G59,' '!$A$1:$B$30,2,FALSE)),VLOOKUP(G59,'  '!$C$5:$D$370,2,FALSE))","v":""},"","1900-01-07","2019-07-13",{"$f":"IF(ISERROR(VLOOKUP(K59,'  '!$C$5:$D$370,2,FALSE)),IF(ISERROR(VLOOKUP(K59,' '!$A$1:$B$30,2,FALSE)),\"\",VLOOKUP(K59,' '!$A$1:$B$30,2,FALSE)),VLOOKUP(K59,'  '!$C$5:$D$370,2,FALSE))","v":""},"","1900-01-03","2019-08-13",{"$f":"IF(ISERROR(VLOOKUP(O59,'  '!$C$5:$D$370,2,FALSE)),IF(ISERROR(VLOOKUP(O59,' '!$A$1:$B$30,2,FALSE)),\"\",VLOOKUP(O59,' '!$A$1:$B$30,2,FALSE)),VLOOKUP(O59,'  '!$C$5:$D$370,2,FALSE))","v":""},"","1900-01-06","2019-09-13",{"$f":"IF(ISERROR(VLOOKUP(S59,'  '!$C$5:$D$370,2,FALSE)),IF(ISERROR(VLOOKUP(S59,' '!$A$1:$B$30,2,FALSE)),\"\",VLOOKUP(S59,' '!$A$1:$B$30,2,FALSE)),VLOOKUP(S59,'  '!$C$5:$D$370,2,FALSE))","v":""},"","1900-01-01","2019-10-13",{"$f":"IF(ISERROR(VLOOKUP(W59,'  '!$C$5:$D$370,2,FALSE)),IF(ISERROR(VLOOKUP(W59,' '!$A$1:$B$30,2,FALSE)),\"\",VLOOKUP(W59,' '!$A$1:$B$30,2,FALSE)),VLOOKUP(W59,'  '!$C$5:$D$370,2,FALSE))","v":""},""]
[null,"1900-01-03","2019-05-14",{"$f":"IF(ISERROR(VLOOKUP(C60,'  '!$C$5:$D$370,2,FALSE)),IF(ISERROR(VLOOKUP(C60,' '!$A$1:$B$30,2,FALSE)),\"\",VLOOKUP(C60,' '!$A$1:$B$30,2,FALSE)),VLOOKUP(C60,'  '!$C$5:$D$370,2,FALSE))","v":""},"","1900-01-06","2019-06-14",{"$f":"IF(ISERROR(VLOOKUP(G60,'  '!$C$5:$D$370,2,FALSE)),IF(ISERROR(VLOOKUP(G60,' '!$A$1:$B$30,2,FALSE)),\"\",VLOOKUP(G60,' '!$A$1:$B$30,2,FALSE)),VLOOKUP(G60,'  '!$C$5:$D$370,2,FALSE))","v":""},"","1900-01-01","2019-07-14",null,"","1900-01-04","2019-08-14",{"$f":"IF(ISERROR(VLOOKUP(O60,'  '!$C$5:$D$370,2,FALSE)),IF(ISERROR(VLOOKUP(O60,' '!$A$1:$B$30,2,FALSE)),\"\",VLOOKUP(O60,' '!$A$1:$B$30,2,FALSE)),VLOOKUP(O60,'  '!$C$5:$D$370,2,FALSE))","v":""},"","1900-01-07","2019-09-14",{"$f":"IF(ISERROR(VLOOKUP(S60,'  '!$C$5:$D$370,2,FALSE)),IF(ISERROR(VLOOKUP(S60,' '!$A$1:$B$30,2,FALSE)),\"\",VLOOKUP(S60,' '!$A$1:$B$30,2,FALSE)),VLOOKUP(S60,'  '!$C$5:$D$370,2,FALSE))","v":""},"","1900-01-02","2019-10-14","Efterårsprof",42]
[null,"1900-01-04","2019-05-15",{"$f":"IF(ISERROR(VLOOKUP(C61,'  '!$C$5:$D$370,2,FALSE)),IF(ISERROR(VLOOKUP(C61,' '!$A$1:$B$30,2,FALSE)),\"\",VLOOKUP(C61,' '!$A$1:$B$30,2,FALSE)),VLOOKUP(C61,'  '!$C$5:$D$370,2,FALSE))","v":""},"","1900-01-07","2019-06-15",{"$f":"IF(ISERROR(VLOOKUP(G61,'  '!$C$5:$D$370,2,FALSE)),IF(ISERROR(VLOOKUP(G61,' '!$A$1:$B$30,2,FALSE)),\"\",VLOOKUP(G61,' '!$A$1:$B$30,2,FALSE)),VLOOKUP(G61,'  '!$C$5:$D$370,2,FALSE))","v":""},"","1900-01-02","2019-07-15",{"$f":"IF(ISERROR(VLOOKUP(K61,'  '!$C$5:$D$370,2,FALSE)),IF(ISERROR(VLOOKUP(K61,' '!$A$1:$B$30,2,FALSE)),\"\",VLOOKUP(K61,' '!$A$1:$B$30,2,FALSE)),VLOOKUP(K61,'  '!$C$5:$D$370,2,FALSE))","v":""},29,"1900-01-05","2019-08-15",null,"","1900-01-01","2019-09-15",{"$f":"IF(ISERROR(VLOOKUP(S61,'  '!$C$5:$D$370,2,FALSE)),IF(ISERROR(VLOOKUP(S61,' '!$A$1:$B$30,2,FALSE)),\"\",VLOOKUP(S61,' '!$A$1:$B$30,2,FALSE)),VLOOKUP(S61,'  '!$C$5:$D$370,2,FALSE))","v":""},"","1900-01-03","2019-10-15","Efterårsprof",""]
[null,"1900-01-05","2019-05-16",{"$f":"IF(ISERROR(VLOOKUP(C62,'  '!$C$5:$D$370,2,FALSE)),IF(ISERROR(VLOOKUP(C62,' '!$A$1:$B$30,2,FALSE)),\"\",VLOOKUP(C62,' '!$A$1:$B$30,2,FALSE)),VLOOKUP(C62,'  '!$C$5:$D$370,2,FALSE))","v":""},"","1900-01-01","2019-06-16",{"$f":"IF(ISERROR(VLOOKUP(G62,'  '!$C$5:$D$370,2,FALSE)),IF(ISERROR(VLOOKUP(G62,' '!$A$1:$B$30,2,FALSE)),\"\",VLOOKUP(G62,' '!$A$1:$B$30,2,FALSE)),VLOOKUP(G62,'  '!$C$5:$D$370,2,FALSE))","v":""},"","1900-01-03","2019-07-16",{"$f":"IF(ISERROR(VLOOKUP(K62,'  '!$C$5:$D$370,2,FALSE)),IF(ISERROR(VLOOKUP(K62,' '!$A$1:$B$30,2,FALSE)),\"\",VLOOKUP(K62,' '!$A$1:$B$30,2,FALSE)),VLOOKUP(K62,'  '!$C$5:$D$370,2,FALSE))","v":""},"","1900-01-06","2019-08-16",null,"","1900-01-02","2019-09-16",{"$f":"IF(ISERROR(VLOOKUP(S62,'  '!$C$5:$D$370,2,FALSE)),IF(ISERROR(VLOOKUP(S62,' '!$A$1:$B$30,2,FALSE)),\"\",VLOOKUP(S62,' '!$A$1:$B$30,2,FALSE)),VLOOKUP(S62,'  '!$C$5:$D$370,2,FALSE))","v":""},38,"1900-01-04","2019-10-16",{"$f":"IF(ISERROR(VLOOKUP(W62,'  '!$C$5:$D$370,2,FALSE)),IF(ISERROR(VLOOKUP(W62,' '!$A$1:$B$30,2,FALSE)),\"\",VLOOKUP(W62,' '!$A$1:$B$30,2,FALSE)),VLOOKUP(W62,'  '!$C$5:$D$370,2,FALSE))","v":""},""]
[null,"1900-01-06","2019-05-17",{"$f":"IF(ISERROR(VLOOKUP(C63,'  '!$C$5:$D$370,2,FALSE)),IF(ISERROR(VLOOKUP(C63,' '!$A$1:$B$30,2,FALSE)),\"\",VLOOKUP(C63,' '!$A$1:$B$30,2,FALSE)),VLOOKUP(C63,'  '!$C$5:$D$370,2,FALSE))","v":"Store Bededag"},"","1900-01-02","2019-06-17",{"$f":"IF(ISERROR(VLOOKUP(G63,'  '!$C$5:$D$370,2,FALSE)),IF(ISERROR(VLOOKUP(G63,' '!$A$1:$B$30,2,FALSE)),\"\",VLOOKUP(G63,' '!$A$1:$B$30,2,FALSE)),VLOOKUP(G63,'  '!$C$5:$D$370,2,FALSE))","v":""},25,"1900-01-04","2019-07-17",{"$f":"IF(ISERROR(VLOOKUP(K63,'  '!$C$5:$D$370,2,FALSE)),IF(ISERROR(VLOOKUP(K63,' '!$A$1:$B$30,2,FALSE)),\"\",VLOOKUP(K63,' '!$A$1:$B$30,2,FALSE)),VLOOKUP(K63,'  '!$C$5:$D$370,2,FALSE))","v":""},"","1900-01-07","2019-08-17",{"$f":"IF(ISERROR(VLOOKUP(O63,'  '!$C$5:$D$370,2,FALSE)),IF(ISERROR(VLOOKUP(O63,' '!$A$1:$B$30,2,FALSE)),\"\",VLOOKUP(O63,' '!$A$1:$B$30,2,FALSE)),VLOOKUP(O63,'  '!$C$5:$D$370,2,FALSE))","v":""},"","1900-01-03","2019-09-17",{"$f":"IF(ISERROR(VLOOKUP(S63,'  '!$C$5:$D$370,2,FALSE)),IF(ISERROR(VLOOKUP(S63,' '!$A$1:$B$30,2,FALSE)),\"\",VLOOKUP(S63,' '!$A$1:$B$30,2,FALSE)),VLOOKUP(S63,'  '!$C$5:$D$370,2,FALSE))","v":""},"","1900-01-05","2019-10-17",{"$f":"IF(ISERROR(VLOOKUP(W63,'  '!$C$5:$D$370,2,FALSE)),IF(ISERROR(VLOOKUP(W63,' '!$A$1:$B$30,2,FALSE)),\"\",VLOOKUP(W63,' '!$A$1:$B$30,2,FALSE)),VLOOKUP(W63,'  '!$C$5:$D$370,2,FALSE))","v":""},""]
[null,"1900-01-07","2019-05-18",{"$f":"IF(ISERROR(VLOOKUP(C64,'  '!$C$5:$D$370,2,FALSE)),IF(ISERROR(VLOOKUP(C64,' '!$A$1:$B$30,2,FALSE)),\"\",VLOOKUP(C64,' '!$A$1:$B$30,2,FALSE)),VLOOKUP(C64,'  '!$C$5:$D$370,2,FALSE))","v":""},"","1900-01-03","2019-06-18",{"$f":"IF(ISERROR(VLOOKUP(G64,'  '!$C$5:$D$370,2,FALSE)),IF(ISERROR(VLOOKUP(G64,' '!$A$1:$B$30,2,FALSE)),\"\",VLOOKUP(G64,' '!$A$1:$B$30,2,FALSE)),VLOOKUP(G64,'  '!$C$5:$D$370,2,FALSE))","v":""},"","1900-01-05","2019-07-18",{"$f":"IF(ISERROR(VLOOKUP(K64,'  '!$C$5:$D$370,2,FALSE)),IF(ISERROR(VLOOKUP(K64,' '!$A$1:$B$30,2,FALSE)),\"\",VLOOKUP(K64,' '!$A$1:$B$30,2,FALSE)),VLOOKUP(K64,'  '!$C$5:$D$370,2,FALSE))","v":""},"","1900-01-01","2019-08-18",{"$f":"IF(ISERROR(VLOOKUP(O64,'  '!$C$5:$D$370,2,FALSE)),IF(ISERROR(VLOOKUP(O64,' '!$A$1:$B$30,2,FALSE)),\"\",VLOOKUP(O64,' '!$A$1:$B$30,2,FALSE)),VLOOKUP(O64,'  '!$C$5:$D$370,2,FALSE))","v":""},"","1900-01-04","2019-09-18",{"$f":"IF(ISERROR(VLOOKUP(S64,'  '!$C$5:$D$370,2,FALSE)),IF(ISERROR(VLOOKUP(S64,' '!$A$1:$B$30,2,FALSE)),\"\",VLOOKUP(S64,' '!$A$1:$B$30,2,FALSE)),VLOOKUP(S64,'  '!$C$5:$D$370,2,FALSE))","v":""},"","1900-01-06","2019-10-18",{"$f":"IF(ISERROR(VLOOKUP(W64,'  '!$C$5:$D$370,2,FALSE)),IF(ISERROR(VLOOKUP(W64,' '!$A$1:$B$30,2,FALSE)),\"\",VLOOKUP(W64,' '!$A$1:$B$30,2,FALSE)),VLOOKUP(W64,'  '!$C$5:$D$370,2,FALSE))","v":""},""]
[null,"1900-01-01","2019-05-19",{"$f":"IF(ISERROR(VLOOKUP(C65,'  '!$C$5:$D$370,2,FALSE)),IF(ISERROR(VLOOKUP(C65,' '!$A$1:$B$30,2,FALSE)),\"\",VLOOKUP(C65,' '!$A$1:$B$30,2,FALSE)),VLOOKUP(C65,'  '!$C$5:$D$370,2,FALSE))","v":""},"","1900-01-04","2019-06-19",{"$f":"IF(ISERROR(VLOOKUP(G65,'  '!$C$5:$D$370,2,FALSE)),IF(ISERROR(VLOOKUP(G65,' '!$A$1:$B$30,2,FALSE)),\"\",VLOOKUP(G65,' '!$A$1:$B$30,2,FALSE)),VLOOKUP(G65,'  '!$C$5:$D$370,2,FALSE))","v":""},"","1900-01-06","2019-07-19",{"$f":"IF(ISERROR(VLOOKUP(K65,'  '!$C$5:$D$370,2,FALSE)),IF(ISERROR(VLOOKUP(K65,' '!$A$1:$B$30,2,FALSE)),\"\",VLOOKUP(K65,' '!$A$1:$B$30,2,FALSE)),VLOOKUP(K65,'  '!$C$5:$D$370,2,FALSE))","v":""},"","1900-01-02","2019-08-19",{"$f":"IF(ISERROR(VLOOKUP(O65,'  '!$C$5:$D$370,2,FALSE)),IF(ISERROR(VLOOKUP(O65,' '!$A$1:$B$30,2,FALSE)),\"\",VLOOKUP(O65,' '!$A$1:$B$30,2,FALSE)),VLOOKUP(O65,'  '!$C$5:$D$370,2,FALSE))","v":""},34,"1900-01-05","2019-09-19",{"$f":"IF(ISERROR(VLOOKUP(S65,'  '!$C$5:$D$370,2,FALSE)),IF(ISERROR(VLOOKUP(S65,' '!$A$1:$B$30,2,FALSE)),\"\",VLOOKUP(S65,' '!$A$1:$B$30,2,FALSE)),VLOOKUP(S65,'  '!$C$5:$D$370,2,FALSE))","v":""},"","1900-01-07","2019-10-19",{"$f":"IF(ISERROR(VLOOKUP(W65,'  '!$C$5:$D$370,2,FALSE)),IF(ISERROR(VLOOKUP(W65,' '!$A$1:$B$30,2,FALSE)),\"\",VLOOKUP(W65,' '!$A$1:$B$30,2,FALSE)),VLOOKUP(W65,'  '!$C$5:$D$370,2,FALSE))","v":""},""]
[null,"1900-01-02","2019-05-20",null,21,"1900-01-05","2019-06-20",{"$f":"IF(ISERROR(VLOOKUP(G66,'  '!$C$5:$D$370,2,FALSE)),IF(ISERROR(VLOOKUP(G66,' '!$A$1:$B$30,2,FALSE)),\"\",VLOOKUP(G66,' '!$A$1:$B$30,2,FALSE)),VLOOKUP(G66,'  '!$C$5:$D$370,2,FALSE))","v":""},"","1900-01-07","2019-07-20",{"$f":"IF(ISERROR(VLOOKUP(K66,'  '!$C$5:$D$370,2,FALSE)),IF(ISERROR(VLOOKUP(K66,' '!$A$1:$B$30,2,FALSE)),\"\",VLOOKUP(K66,' '!$A$1:$B$30,2,FALSE)),VLOOKUP(K66,'  '!$C$5:$D$370,2,FALSE))","v":""},"","1900-01-03","2019-08-20",{"$f":"IF(ISERROR(VLOOKUP(O66,'  '!$C$5:$D$370,2,FALSE)),IF(ISERROR(VLOOKUP(O66,' '!$A$1:$B$30,2,FALSE)),\"\",VLOOKUP(O66,' '!$A$1:$B$30,2,FALSE)),VLOOKUP(O66,'  '!$C$5:$D$370,2,FALSE))","v":""},"","1900-01-06","2019-09-20",null,"","1900-01-01","2019-10-20",{"$f":"IF(ISERROR(VLOOKUP(W66,'  '!$C$5:$D$370,2,FALSE)),IF(ISERROR(VLOOKUP(W66,' '!$A$1:$B$30,2,FALSE)),\"\",VLOOKUP(W66,' '!$A$1:$B$30,2,FALSE)),VLOOKUP(W66,'  '!$C$5:$D$370,2,FALSE))","v":""},""]
[null,"1900-01-03","2019-05-21",{"$f":"IF(ISERROR(VLOOKUP(C67,'  '!$C$5:$D$370,2,FALSE)),IF(ISERROR(VLOOKUP(C67,' '!$A$1:$B$30,2,FALSE)),\"\",VLOOKUP(C67,' '!$A$1:$B$30,2,FALSE)),VLOOKUP(C67,'  '!$C$5:$D$370,2,FALSE))","v":""},"","1900-01-06","2019-06-21",{"$f":"IF(ISERROR(VLOOKUP(G67,'  '!$C$5:$D$370,2,FALSE)),IF(ISERROR(VLOOKUP(G67,' '!$A$1:$B$30,2,FALSE)),\"\",VLOOKUP(G67,' '!$A$1:$B$30,2,FALSE)),VLOOKUP(G67,'  '!$C$5:$D$370,2,FALSE))","v":""},"","1900-01-01","2019-07-21",{"$f":"IF(ISERROR(VLOOKUP(K67,'  '!$C$5:$D$370,2,FALSE)),IF(ISERROR(VLOOKUP(K67,' '!$A$1:$B$30,2,FALSE)),\"\",VLOOKUP(K67,' '!$A$1:$B$30,2,FALSE)),VLOOKUP(K67,'  '!$C$5:$D$370,2,FALSE))","v":""},"","1900-01-04","2019-08-21",{"$f":"IF(ISERROR(VLOOKUP(O67,'  '!$C$5:$D$370,2,FALSE)),IF(ISERROR(VLOOKUP(O67,' '!$A$1:$B$30,2,FALSE)),\"\",VLOOKUP(O67,' '!$A$1:$B$30,2,FALSE)),VLOOKUP(O67,'  '!$C$5:$D$370,2,FALSE))","v":""},"","1900-01-07","2019-09-21",{"$f":"IF(ISERROR(VLOOKUP(S67,'  '!$C$5:$D$370,2,FALSE)),IF(ISERROR(VLOOKUP(S67,' '!$A$1:$B$30,2,FALSE)),\"\",VLOOKUP(S67,' '!$A$1:$B$30,2,FALSE)),VLOOKUP(S67,'  '!$C$5:$D$370,2,FALSE))","v":""},"","1900-01-02","2019-10-21",{"$f":"IF(ISERROR(VLOOKUP(W67,'  '!$C$5:$D$370,2,FALSE)),IF(ISERROR(VLOOKUP(W67,' '!$A$1:$B$30,2,FALSE)),\"\",VLOOKUP(W67,' '!$A$1:$B$30,2,FALSE)),VLOOKUP(W67,'  '!$C$5:$D$370,2,FALSE))","v":""},43]
[null,"1900-01-04","2019-05-22",{"$f":"IF(ISERROR(VLOOKUP(C68,'  '!$C$5:$D$370,2,FALSE)),IF(ISERROR(VLOOKUP(C68,' '!$A$1:$B$30,2,FALSE)),\"\",VLOOKUP(C68,' '!$A$1:$B$30,2,FALSE)),VLOOKUP(C68,'  '!$C$5:$D$370,2,FALSE))","v":""},"","1900-01-07","2019-06-22",{"$f":"IF(ISERROR(VLOOKUP(G68,'  '!$C$5:$D$370,2,FALSE)),IF(ISERROR(VLOOKUP(G68,' '!$A$1:$B$30,2,FALSE)),\"\",VLOOKUP(G68,' '!$A$1:$B$30,2,FALSE)),VLOOKUP(G68,'  '!$C$5:$D$370,2,FALSE))","v":""},"","1900-01-02","2019-07-22",{"$f":"IF(ISERROR(VLOOKUP(K68,'  '!$C$5:$D$370,2,FALSE)),IF(ISERROR(VLOOKUP(K68,' '!$A$1:$B$30,2,FALSE)),\"\",VLOOKUP(K68,' '!$A$1:$B$30,2,FALSE)),VLOOKUP(K68,'  '!$C$5:$D$370,2,FALSE))","v":""},30,"1900-01-05","2019-08-22",{"$f":"IF(ISERROR(VLOOKUP(O68,'  '!$C$5:$D$370,2,FALSE)),IF(ISERROR(VLOOKUP(O68,' '!$A$1:$B$30,2,FALSE)),\"\",VLOOKUP(O68,' '!$A$1:$B$30,2,FALSE)),VLOOKUP(O68,'  '!$C$5:$D$370,2,FALSE))","v":""},"","1900-01-01","2019-09-22",{"$f":"IF(ISERROR(VLOOKUP(S68,'  '!$C$5:$D$370,2,FALSE)),IF(ISERROR(VLOOKUP(S68,' '!$A$1:$B$30,2,FALSE)),\"\",VLOOKUP(S68,' '!$A$1:$B$30,2,FALSE)),VLOOKUP(S68,'  '!$C$5:$D$370,2,FALSE))","v":""},"","1900-01-03","2019-10-22",{"$f":"IF(ISERROR(VLOOKUP(W68,'  '!$C$5:$D$370,2,FALSE)),IF(ISERROR(VLOOKUP(W68,' '!$A$1:$B$30,2,FALSE)),\"\",VLOOKUP(W68,' '!$A$1:$B$30,2,FALSE)),VLOOKUP(W68,'  '!$C$5:$D$370,2,FALSE))","v":""},""]
[null,"1900-01-05","2019-05-23",null,"","1900-01-01","2019-06-23",{"$f":"IF(ISERROR(VLOOKUP(G69,'  '!$C$5:$D$370,2,FALSE)),IF(ISERROR(VLOOKUP(G69,' '!$A$1:$B$30,2,FALSE)),\"\",VLOOKUP(G69,' '!$A$1:$B$30,2,FALSE)),VLOOKUP(G69,'  '!$C$5:$D$370,2,FALSE))","v":""},"","1900-01-03","2019-07-23",{"$f":"IF(ISERROR(VLOOKUP(K69,'  '!$C$5:$D$370,2,FALSE)),IF(ISERROR(VLOOKUP(K69,' '!$A$1:$B$30,2,FALSE)),\"\",VLOOKUP(K69,' '!$A$1:$B$30,2,FALSE)),VLOOKUP(K69,'  '!$C$5:$D$370,2,FALSE))","v":""},"","1900-01-06","2019-08-23",{"$f":"IF(ISERROR(VLOOKUP(O69,'  '!$C$5:$D$370,2,FALSE)),IF(ISERROR(VLOOKUP(O69,' '!$A$1:$B$30,2,FALSE)),\"\",VLOOKUP(O69,' '!$A$1:$B$30,2,FALSE)),VLOOKUP(O69,'  '!$C$5:$D$370,2,FALSE))","v":""},"","1900-01-02","2019-09-23",{"$f":"IF(ISERROR(VLOOKUP(S69,'  '!$C$5:$D$370,2,FALSE)),IF(ISERROR(VLOOKUP(S69,' '!$A$1:$B$30,2,FALSE)),\"\",VLOOKUP(S69,' '!$A$1:$B$30,2,FALSE)),VLOOKUP(S69,'  '!$C$5:$D$370,2,FALSE))","v":""},39,"1900-01-04","2019-10-23",{"$f":"IF(ISERROR(VLOOKUP(W69,'  '!$C$5:$D$370,2,FALSE)),IF(ISERROR(VLOOKUP(W69,' '!$A$1:$B$30,2,FALSE)),\"\",VLOOKUP(W69,' '!$A$1:$B$30,2,FALSE)),VLOOKUP(W69,'  '!$C$5:$D$370,2,FALSE))","v":""},""]
[null,"1900-01-06","2019-05-24",null,"","1900-01-02","2019-06-24",{"$f":"IF(ISERROR(VLOOKUP(G70,'  '!$C$5:$D$370,2,FALSE)),IF(ISERROR(VLOOKUP(G70,' '!$A$1:$B$30,2,FALSE)),\"\",VLOOKUP(G70,' '!$A$1:$B$30,2,FALSE)),VLOOKUP(G70,'  '!$C$5:$D$370,2,FALSE))","v":""},26,"1900-01-04","2019-07-24",{"$f":"IF(ISERROR(VLOOKUP(K70,'  '!$C$5:$D$370,2,FALSE)),IF(ISERROR(VLOOKUP(K70,' '!$A$1:$B$30,2,FALSE)),\"\",VLOOKUP(K70,' '!$A$1:$B$30,2,FALSE)),VLOOKUP(K70,'  '!$C$5:$D$370,2,FALSE))","v":""},"","1900-01-07","2019-08-24",{"$f":"IF(ISERROR(VLOOKUP(O70,'  '!$C$5:$D$370,2,FALSE)),IF(ISERROR(VLOOKUP(O70,' '!$A$1:$B$30,2,FALSE)),\"\",VLOOKUP(O70,' '!$A$1:$B$30,2,FALSE)),VLOOKUP(O70,'  '!$C$5:$D$370,2,FALSE))","v":""},"","1900-01-03","2019-09-24","Gl. drenge","","1900-01-05","2019-10-24",{"$f":"IF(ISERROR(VLOOKUP(W70,'  '!$C$5:$D$370,2,FALSE)),IF(ISERROR(VLOOKUP(W70,' '!$A$1:$B$30,2,FALSE)),\"\",VLOOKUP(W70,' '!$A$1:$B$30,2,FALSE)),VLOOKUP(W70,'  '!$C$5:$D$370,2,FALSE))","v":""},""]
[null,"1900-01-07","2019-05-25",null,"","1900-01-03","2019-06-25","Gl. drenge","","1900-01-05","2019-07-25",{"$f":"IF(ISERROR(VLOOKUP(K71,'  '!$C$5:$D$370,2,FALSE)),IF(ISERROR(VLOOKUP(K71,' '!$A$1:$B$30,2,FALSE)),\"\",VLOOKUP(K71,' '!$A$1:$B$30,2,FALSE)),VLOOKUP(K71,'  '!$C$5:$D$370,2,FALSE))","v":""},"","1900-01-01","2019-08-25",{"$f":"IF(ISERROR(VLOOKUP(O71,'  '!$C$5:$D$370,2,FALSE)),IF(ISERROR(VLOOKUP(O71,' '!$A$1:$B$30,2,FALSE)),\"\",VLOOKUP(O71,' '!$A$1:$B$30,2,FALSE)),VLOOKUP(O71,'  '!$C$5:$D$370,2,FALSE))","v":""},"","1900-01-04","2019-09-25",{"$f":"IF(ISERROR(VLOOKUP(S71,'  '!$C$5:$D$370,2,FALSE)),IF(ISERROR(VLOOKUP(S71,' '!$A$1:$B$30,2,FALSE)),\"\",VLOOKUP(S71,' '!$A$1:$B$30,2,FALSE)),VLOOKUP(S71,'  '!$C$5:$D$370,2,FALSE))","v":""},"","1900-01-06","2019-10-25",{"$f":"IF(ISERROR(VLOOKUP(W71,'  '!$C$5:$D$370,2,FALSE)),IF(ISERROR(VLOOKUP(W71,' '!$A$1:$B$30,2,FALSE)),\"\",VLOOKUP(W71,' '!$A$1:$B$30,2,FALSE)),VLOOKUP(W71,'  '!$C$5:$D$370,2,FALSE))","v":""},""]
[null,"1900-01-01","2019-05-26",null,"","1900-01-04","2019-06-26",{"$f":"IF(ISERROR(VLOOKUP(G72,'  '!$C$5:$D$370,2,FALSE)),IF(ISERROR(VLOOKUP(G72,' '!$A$1:$B$30,2,FALSE)),\"\",VLOOKUP(G72,' '!$A$1:$B$30,2,FALSE)),VLOOKUP(G72,'  '!$C$5:$D$370,2,FALSE))","v":""},"","1900-01-06","2019-07-26",{"$f":"IF(ISERROR(VLOOKUP(K72,'  '!$C$5:$D$370,2,FALSE)),IF(ISERROR(VLOOKUP(K72,' '!$A$1:$B$30,2,FALSE)),\"\",VLOOKUP(K72,' '!$A$1:$B$30,2,FALSE)),VLOOKUP(K72,'  '!$C$5:$D$370,2,FALSE))","v":""},"","1900-01-02","2019-08-26",{"$f":"IF(ISERROR(VLOOKUP(O72,'  '!$C$5:$D$370,2,FALSE)),IF(ISERROR(VLOOKUP(O72,' '!$A$1:$B$30,2,FALSE)),\"\",VLOOKUP(O72,' '!$A$1:$B$30,2,FALSE)),VLOOKUP(O72,'  '!$C$5:$D$370,2,FALSE))","v":""},35,"1900-01-05","2019-09-26",{"$f":"IF(ISERROR(VLOOKUP(S72,'  '!$C$5:$D$370,2,FALSE)),IF(ISERROR(VLOOKUP(S72,' '!$A$1:$B$30,2,FALSE)),\"\",VLOOKUP(S72,' '!$A$1:$B$30,2,FALSE)),VLOOKUP(S72,'  '!$C$5:$D$370,2,FALSE))","v":""},"","1900-01-07","2019-10-26",{"$f":"IF(ISERROR(VLOOKUP(W72,'  '!$C$5:$D$370,2,FALSE)),IF(ISERROR(VLOOKUP(W72,' '!$A$1:$B$30,2,FALSE)),\"\",VLOOKUP(W72,' '!$A$1:$B$30,2,FALSE)),VLOOKUP(W72,'  '!$C$5:$D$370,2,FALSE))","v":""},""]
[null,"1900-01-02","2019-05-27",null,22,"1900-01-05","2019-06-27",{"$f":"IF(ISERROR(VLOOKUP(G73,'  '!$C$5:$D$370,2,FALSE)),IF(ISERROR(VLOOKUP(G73,' '!$A$1:$B$30,2,FALSE)),\"\",VLOOKUP(G73,' '!$A$1:$B$30,2,FALSE)),VLOOKUP(G73,'  '!$C$5:$D$370,2,FALSE))","v":""},"","1900-01-07","2019-07-27",{"$f":"IF(ISERROR(VLOOKUP(K73,'  '!$C$5:$D$370,2,FALSE)),IF(ISERROR(VLOOKUP(K73,' '!$A$1:$B$30,2,FALSE)),\"\",VLOOKUP(K73,' '!$A$1:$B$30,2,FALSE)),VLOOKUP(K73,'  '!$C$5:$D$370,2,FALSE))","v":""},"","1900-01-03","2019-08-27","Gl. drenge","","1900-01-06","2019-09-27",{"$f":"IF(ISERROR(VLOOKUP(S73,'  '!$C$5:$D$370,2,FALSE)),IF(ISERROR(VLOOKUP(S73,' '!$A$1:$B$30,2,FALSE)),\"\",VLOOKUP(S73,' '!$A$1:$B$30,2,FALSE)),VLOOKUP(S73,'  '!$C$5:$D$370,2,FALSE))","v":""},"","1900-01-01","2019-10-27",{"$f":"IF(ISERROR(VLOOKUP(W73,'  '!$C$5:$D$370,2,FALSE)),IF(ISERROR(VLOOKUP(W73,' '!$A$1:$B$30,2,FALSE)),\"\",VLOOKUP(W73,' '!$A$1:$B$30,2,FALSE)),VLOOKUP(W73,'  '!$C$5:$D$370,2,FALSE))","v":""},""]
[null,"1900-01-03","2019-05-28","Gl. drenge","","1900-01-06","2019-06-28",{"$f":"IF(ISERROR(VLOOKUP(G74,'  '!$C$5:$D$370,2,FALSE)),IF(ISERROR(VLOOKUP(G74,' '!$A$1:$B$30,2,FALSE)),\"\",VLOOKUP(G74,' '!$A$1:$B$30,2,FALSE)),VLOOKUP(G74,'  '!$C$5:$D$370,2,FALSE))","v":""},"","1900-01-01","2019-07-28",{"$f":"IF(ISERROR(VLOOKUP(K74,'  '!$C$5:$D$370,2,FALSE)),IF(ISERROR(VLOOKUP(K74,' '!$A$1:$B$30,2,FALSE)),\"\",VLOOKUP(K74,' '!$A$1:$B$30,2,FALSE)),VLOOKUP(K74,'  '!$C$5:$D$370,2,FALSE))","v":""},"","1900-01-04","2019-08-28",{"$f":"IF(ISERROR(VLOOKUP(O74,'  '!$C$5:$D$370,2,FALSE)),IF(ISERROR(VLOOKUP(O74,' '!$A$1:$B$30,2,FALSE)),\"\",VLOOKUP(O74,' '!$A$1:$B$30,2,FALSE)),VLOOKUP(O74,'  '!$C$5:$D$370,2,FALSE))","v":""},"","1900-01-07","2019-09-28",{"$f":"IF(ISERROR(VLOOKUP(S74,'  '!$C$5:$D$370,2,FALSE)),IF(ISERROR(VLOOKUP(S74,' '!$A$1:$B$30,2,FALSE)),\"\",VLOOKUP(S74,' '!$A$1:$B$30,2,FALSE)),VLOOKUP(S74,'  '!$C$5:$D$370,2,FALSE))","v":""},"","1900-01-02","2019-10-28",{"$f":"IF(ISERROR(VLOOKUP(W74,'  '!$C$5:$D$370,2,FALSE)),IF(ISERROR(VLOOKUP(W74,' '!$A$1:$B$30,2,FALSE)),\"\",VLOOKUP(W74,' '!$A$1:$B$30,2,FALSE)),VLOOKUP(W74,'  '!$C$5:$D$370,2,FALSE))","v":""},44]
[null,{"$f":"IF(C75=\"\",\"\",WEEKDAY(C75,1))","v":"1900-01-04"},{"$f":"IF(C74=\"\",\"\",IF(DAY(C74)>DAY(C74+1),\"\",C74+1))","v":"2019-05-29"},{"$f":"IF(ISERROR(VLOOKUP(C75,'  '!$C$5:$D$370,2,FALSE)),IF(ISERROR(VLOOKUP(C75,' '!$A$1:$B$30,2,FALSE)),\"\",VLOOKUP(C75,' '!$A$1:$B$30,2,FALSE)),VLOOKUP(C75,'  '!$C$5:$D$370,2,FALSE))","v":""},"",{"$f":"IF(G75=\"\",\"\",WEEKDAY(G75,1))","v":"1900-01-07"},{"$f":"IF(G74=\"\",\"\",IF(DAY(G74)>DAY(G74+1),\"\",G74+1))","v":"2019-06-29"},{"$f":"IF(ISERROR(VLOOKUP(G75,'  '!$C$5:$D$370,2,FALSE)),IF(ISERROR(VLOOKUP(G75,' '!$A$1:$B$30,2,FALSE)),\"\",VLOOKUP(G75,' '!$A$1:$B$30,2,FALSE)),VLOOKUP(G75,'  '!$C$5:$D$370,2,FALSE))","v":""},"",{"$f":"IF(K75=\"\",\"\",WEEKDAY(K75,1))","v":"1900-01-02"},{"$f":"IF(K74=\"\",\"\",IF(DAY(K74)>DAY(K74+1),\"\",K74+1))","v":"2019-07-29"},{"$f":"IF(ISERROR(VLOOKUP(K75,'  '!$C$5:$D$370,2,FALSE)),IF(ISERROR(VLOOKUP(K75,' '!$A$1:$B$30,2,FALSE)),\"\",VLOOKUP(K75,' '!$A$1:$B$30,2,FALSE)),VLOOKUP(K75,'  '!$C$5:$D$370,2,FALSE))","v":""},31,{"$f":"IF(O75=\"\",\"\",WEEKDAY(O75,1))","v":"1900-01-05"},{"$f":"IF(O74=\"\",\"\",IF(DAY(O74)>DAY(O74+1),\"\",O74+1))","v":"2019-08-29"},{"$f":"IF(ISERROR(VLOOKUP(O75,'  '!$C$5:$D$370,2,FALSE)),IF(ISERROR(VLOOKUP(O75,' '!$A$1:$B$30,2,FALSE)),\"\",VLOOKUP(O75,' '!$A$1:$B$30,2,FALSE)),VLOOKUP(O75,'  '!$C$5:$D$370,2,FALSE))","v":""},"",{"$f":"IF(S75=\"\",\"\",WEEKDAY(S75,1))","v":"1900-01-01"},{"$f":"IF(S74=\"\",\"\",IF(DAY(S74)>DAY(S74+1),\"\",S74+1))","v":"2019-09-29"},{"$f":"IF(ISERROR(VLOOKUP(S75,'  '!$C$5:$D$370,2,FALSE)),IF(ISERROR(VLOOKUP(S75,' '!$A$1:$B$30,2,FALSE)),\"\",VLOOKUP(S75,' '!$A$1:$B$30,2,FALSE)),VLOOKUP(S75,'  '!$C$5:$D$370,2,FALSE))","v":""},"",{"$f":"IF(W75=\"\",\"\",WEEKDAY(W75,1))","v":"1900-01-03"},{"$f":"IF(W74=\"\",\"\",IF(DAY(W74)>DAY(W74+1),\"\",W74+1))","v":"2019-10-29"},"Gl. drenge",""]
[null,{"$f":"IF(C76=\"\",\"\",WEEKDAY(C76,1))","v":"1900-01-05"},{"$f":"IF(C75=\"\",\"\",IF(DAY(C75)>DAY(C75+1),\"\",C75+1))","v":"2019-05-30"},"Nørhalne cup","",{"$f":"IF(G76=\"\",\"\",WEEKDAY(G76,1))","v":"1900-01-01"},{"$f":"IF(G75=\"\",\"\",IF(DAY(G75)>DAY(G75+1),\"\",G75+1))","v":"2019-06-30"},{"$f":"IF(ISERROR(VLOOKUP(G76,'  '!$C$5:$D$370,2,FALSE)),IF(ISERROR(VLOOKUP(G76,' '!$A$1:$B$30,2,FALSE)),\"\",VLOOKUP(G76,' '!$A$1:$B$30,2,FALSE)),VLOOKUP(G76,'  '!$C$5:$D$370,2,FALSE))","v":""},"",{"$f":"IF(K76=\"\",\"\",WEEKDAY(K76,1))","v":"1900-01-03"},{"$f":"IF(K75=\"\",\"\",IF(DAY(K75)>DAY(K75+1),\"\",K75+1))","v":"2019-07-30"},{"$f":"IF(ISERROR(VLOOKUP(K76,'  '!$C$5:$D$370,2,FALSE)),IF(ISERROR(VLOOKUP(K76,' '!$A$1:$B$30,2,FALSE)),\"\",VLOOKUP(K76,' '!$A$1:$B$30,2,FALSE)),VLOOKUP(K76,'  '!$C$5:$D$370,2,FALSE))","v":""},"",{"$f":"IF(O76=\"\",\"\",WEEKDAY(O76,1))","v":"1900-01-06"},{"$f":"IF(O75=\"\",\"\",IF(DAY(O75)>DAY(O75+1),\"\",O75+1))","v":"2019-08-30"},{"$f":"IF(ISERROR(VLOOKUP(O76,'  '!$C$5:$D$370,2,FALSE)),IF(ISERROR(VLOOKUP(O76,' '!$A$1:$B$30,2,FALSE)),\"\",VLOOKUP(O76,' '!$A$1:$B$30,2,FALSE)),VLOOKUP(O76,'  '!$C$5:$D$370,2,FALSE))","v":""},"",{"$f":"IF(S76=\"\",\"\",WEEKDAY(S76,1))","v":"1900-01-02"},{"$f":"IF(S75=\"\",\"\",IF(DAY(S75)>DAY(S75+1),\"\",S75+1))","v":"2019-09-30"},{"$f":"IF(ISERROR(VLOOKUP(S76,'  '!$C$5:$D$370,2,FALSE)),IF(ISERROR(VLOOKUP(S76,' '!$A$1:$B$30,2,FALSE)),\"\",VLOOKUP(S76,' '!$A$1:$B$30,2,FALSE)),VLOOKUP(S76,'  '!$C$5:$D$370,2,FALSE))","v":""},40,{"$f":"IF(W76=\"\",\"\",WEEKDAY(W76,1))","v":"1900-01-04"},{"$f":"IF(W75=\"\",\"\",IF(DAY(W75)>DAY(W75+1),\"\",W75+1))","v":"2019-10-30"},{"$f":"IF(ISERROR(VLOOKUP(W76,'  '!$C$5:$D$370,2,FALSE)),IF(ISERROR(VLOOKUP(W76,' '!$A$1:$B$30,2,FALSE)),\"\",VLOOKUP(W76,' '!$A$1:$B$30,2,FALSE)),VLOOKUP(W76,'  '!$C$5:$D$370,2,FALSE))","v":""},""]
[null,"1900-01-06","2019-05-31","Nørhalne cup","","","",{"$f":"IF(ISERROR(VLOOKUP(G77,'  '!$C$5:$D$370,2,FALSE)),IF(ISERROR(VLOOKUP(G77,' '!$A$1:$B$30,2,FALSE)),\"\",VLOOKUP(G77,' '!$A$1:$B$30,2,FALSE)),VLOOKUP(G77,'  '!$C$5:$D$370,2,FALSE))","v":""},"","1900-01-04","2019-07-31",null,"","1900-01-07","2019-08-31",{"$f":"IF(ISERROR(VLOOKUP(O77,'  '!$C$5:$D$370,2,FALSE)),IF(ISERROR(VLOOKUP(O77,' '!$A$1:$B$30,2,FALSE)),\"\",VLOOKUP(O77,' '!$A$1:$B$30,2,FALSE)),VLOOKUP(O77,'  '!$C$5:$D$370,2,FALSE))","v":""},"","","",{"$f":"IF(ISERROR(VLOOKUP(S77,'  '!$C$5:$D$370,2,FALSE)),IF(ISERROR(VLOOKUP(S77,' '!$A$1:$B$30,2,FALSE)),\"\",VLOOKUP(S77,' '!$A$1:$B$30,2,FALSE)),VLOOKUP(S77,'  '!$C$5:$D$370,2,FALSE))","v":""},"","1900-01-05","2019-10-31",{"$f":"IF(ISERROR(VLOOKUP(W77,'  '!$C$5:$D$370,2,FALSE)),IF(ISERROR(VLOOKUP(W77,' '!$A$1:$B$30,2,FALSE)),\"\",VLOOKUP(W77,' '!$A$1:$B$30,2,FALSE)),VLOOKUP(W77,'  '!$C$5:$D$370,2,FALSE))","v":""},""]
[{"$nulls":4},{"$f":"NETWORKDAYS(MIN(C47:C77),MAX(C47:C77),' '!$A$2:$A$30)& \" arbejdsdage ekskl. \"&COUNTIF(B47:B77,7)& \" lørdage\"","v":"21 arbejdsdage ekskl. 4 lørdage"},null,null,null,{"$f":"NETWORKDAYS(MIN(G47:G77),MAX(G47:G77),' '!$A$2:$A$30)& \" arbejdsdage ekskl. \"&COUNTIF(F47:F77,7)& \" lørdage\"","v":"18 arbejdsdage ekskl. 5 lørdage"},null,null,null,{"$f":"NETWORKDAYS(MIN(K47:K77),MAX(K47:K77),' '!$A$2:$A$30)& \" arbejdsdage ekskl. \"&COUNTIF(J47:J77,7)& \" lørdage\"","v":"23 arbejdsdage ekskl. 4 lørdage"},null,null,null,{"$f":"NETWORKDAYS(MIN(O47:O77),MAX(O47:O77),' '!$A$2:$A$30)& \" arbejdsdage ekskl. \"&COUNTIF(N47:N77,7)& \" lørdage\"","v":"22 arbejdsdage ekskl. 5 lørdage"},null,null,null,{"$f":"NETWORKDAYS(MIN(S47:S77),MAX(S47:S77),' '!$A$2:$A$30)& \" arbejdsdage ekskl. \"&COUNTIF(R47:R77,7)& \" lørdage\"","v":"21 arbejdsdage ekskl. 4 lørdage"},null,null,null,{"$f":"NETWORKDAYS(MIN(W47:W77),MAX(W47:W77),' '!$A$2:$A$30)& \" arbejdsdage ekskl. \"&COUNTIF(V47:V77,7)& \" lørdage\"","v":"23 arbejdsdage ekskl. 4 lørdage"}]

{"sheet":"  ","index":1,"n_rows":4,"n_cols":4,"rows_kept":4,"cut":false,"hidden":false,"merged":[[2,2,2,3],[0,0,0,1]]}
["<<< Tilbage til kalender"]
[]
[null,null,"Brugerdefinerede mærkedage"]
[null,null,"Dato↓ (format dd-mm-åååå)","Tekst↓"]

{"sheet":" ","index":2,"n_rows":45,"n_cols":7,"rows_kept":45,"cut":false,"hidden":true,"merged":[]}
["Dato","Navn",null,null,null,"Måneder","Tal"]
[{"$f":"DATE(B35,1,1)","v":"2018-01-01"},"Nytårsdag",null,null,null,"Januar",1]
[{"$f":"A6-7","v":"2018-03-25"},"Palmesøndag",null,null,null,"Februar",2]
[{"$f":"A6-3","v":"2018-03-29"},"Skærtorsdag",null,null,null,"Marts",3]
[{"$f":"A6-2","v":"2018-03-30"},"Langfredag",null,null,null,"April",4]
[{"$f":"IF(22+B39+B40<=31,DATE(B35,3,0)+IF(22+B39+B40>31,IF(AND(B39=29,B40=6),19,IF(AND(B39=28,B40=6,B36>10),18,B39+B40-9)),22+B39+B40),DATE(B35,4,0)+IF(22+B39+B40>31,IF(AND(B39=29,B40=6),19,IF(AND(B39=28,B40=6,B36>10),18,B39+B40-9)),22+B39+B40))","v":"2018-04-01"},"Påskedag",null,null,null,"Maj",5]
[{"$f":"A6+1","v":"2018-04-02"},"2. påskedag",null,null,null,"Juni",6]
[{"$f":"A6+26","v":"2018-04-27"},"Store Bededag",null,null,null,"Juli",7]
[{"$f":"A8+13","v":"2018-05-10"},"Kristi Himmelfart",null,null,null,"August",8]
[{"$f":"A9+10","v":"2018-05-20"},{"$f":"IF(A10=A12,\"Pinsedag/Gr.lovsdag\",\"Pinsedag\")","v":"Pinsedag"},null,null,null,"September",9]
[{"$f":"A10+1","v":"2018-05-21"},{"$f":"IF(A11=A12,\"2. pinsedag/Gr.lovsdag\",\"2. pinsedag\")","v":"2. pinsedag"},null,null,null,"Oktober",10]
[{"$f":"DATE(B35,6,5)","v":"2018-06-05"},"Grundlovsdag",null,null,null,"November",11]
[{"$f":"DATE(B35,12,25)","v":"2018-12-25"},"1. juledag",null,null,null,"December",12]
[{"$f":"A13+1","v":"2018-12-26"},"2. juledag"]
[{"$f":"DATE(B35,12,31)","v":"2018-12-31"},"Nytårsaftens dag"]
[]
[{"$f":"DATE(C35,1,1)","v":"2019-01-01"},"Nytårsdag"]
[{"$f":"A21-7","v":"2019-04-14"},"Palmesøndag"]
[{"$f":"A21-3","v":"2019-04-18"},"Skærtorsdag"]
[{"$f":"A21-2","v":"2019-04-19"},"Langfredag"]
[{"$f":"IF(22+C39+C40<=31,DATE(C35,3,0)+IF(22+C39+C40>31,IF(AND(C39=29,C40=6),19,IF(AND(C39=28,C40=6,C36>10),18,C39+C40-9)),22+C39+C40),DATE(C35,4,0)+IF(22+C39+C40>31,IF(AND(C39=29,C40=6),19,IF(AND(C39=28,C40=6,C36>10),18,C39+C40-9)),22+C39+C40))","v":"2019-04-21"},"Påskedag"]
[{"$f":"A21+1","v":"2019-04-22"},"2. påskedag"]
[{"$f":"A21+26","v":"2019-05-17"},"Store Bededag"]
[{"$f":"A23+13","v":"2019-05-30"},"Kristi Himmelfart"]
[{"$f":"A24+10","v":"2019-06-09"},"Pinsedag"]
[{"$f":"A25+1","v":"2019-06-10"},{"$f":"IF(A26=A27,B27&\"/2. pinsedag\",\"2. pinsedag\")","v":"2. pinsedag"}]
[{"$f":"DATE(C35,6,5)","v":"2019-06-05"},"Grundlovsdag"]
[{"$f":"DATE(C35,12,25)","v":"2019-12-25"},"1. juledag"]
[{"$f":"A28+1","v":"2019-12-26"},"2. juledag"]
[{"$f":"DATE(C35,12,31)","v":"2019-12-31"},"Nytårsaftens dag"]
[]
[]
[]
[null,"Påske år1","Påske år2"]
["T",{"$f":"'   '!D2","v":2018},{"$f":"B35+1","v":2019}]
["a",{"$f":"MOD(B35,19)","v":4},{"$f":"MOD(C35,19)","v":5}]
["b",{"$f":"MOD(B35,4)","v":2},{"$f":"MOD(C35,4)","v":3}]
["c",{"$f":"MOD(B35,7)","v":2},{"$f":"MOD(C35,7)","v":3}]
["d",{"$f":"MOD((19*B36)+B44,30)","v":10},{"$f":"MOD((19*C36)+C44,30)","v":29}]
["e",{"$f":"MOD((2*B37)+(4*B38)+(6*B39)+B45,7)","v":0},{"$f":"MOD((2*C37)+(4*C38)+(6*C39)+C45,7)","v":1}]
["k",{"$f":"LEFT(B35,2)*1","v":20},{"$f":"LEFT(C35,2)*1","v":20}]
["p",{"$f":"QUOTIENT(13+(8*B41),25)","v":6},{"$f":"QUOTIENT(13+(8*C41),25)","v":6}]
["q",{"$f":"QUOTIENT(B41,4)","v":5},{"$f":"QUOTIENT(C41,4)","v":5}]
["M",{"$f":"MOD(15-B42+B41-B43,30)","v":24},{"$f":"MOD(15-C42+C41-C43,30)","v":24}]
["N",{"$f":"MOD(4+B41-B43,7)","v":5},{"$f":"MOD(4+C41-C43,7)","v":5}]